{"text_format":"1","workbook":"xlsx","n_sheets":35,"sheets":["START","Instructions","Template names","Lookup and lists","Org structure","Contacts","C1-Sum","C2-FinPerf SC","C2C","C3-FinPerf V","C3C","C4-FinPerf RE","C5-Capex","C5C","C6-FinPos","C7-CFlow","SC1","SC2","SC3","SC4","SC5","SC6","SC7(1)","SC7(2)","SC8","SC9","SC10","SC11","SC12","SC13a","SC13b","SC13c","SC13d","SC13e","SC71charts"],"not_rendered":{"charts":5,"images":17,"macros":1,"external_links":5,"defined_names":2031,"comments":0,"pivot_tables":0},"unopened":[],"bounds":{"document_bytes":16777216,"sheet_cells":100000,"rows_first":2000,"rows_last":500,"rows_between":2000,"halvings":0,"cell_chars":16384,"cell_head_chars":4096},"cells_cut":0,"cells_raw":0,"read":"whole","date_system":"1900"}

{"sheet":"START","index":0,"n_rows":1,"n_cols":1,"rows_kept":1,"cut":false,"hidden":false,"merged":[]}
[{"$f":"muni","v":"Choose name from list"}]

{"sheet":"Instructions","index":1,"n_rows":55,"n_cols":25,"rows_kept":55,"cut":false,"hidden":false,"merged":[]}
[]
[null,null,null,2020]
[]
[null,null,null,null,null,null,null,null,null,null,null,null,null,null,null,null,null,null,null,null,null,null,null,"Yes"]
[null,null,null,null,null,null,null,null,null,null,null,null,null,null,null,null,null,null,null,null,null,null,null,"No"]
[]
[null,null,null,null,null,null,null,null,null,null,null,null,null,null,null,null,null,null,null,null,null,null,"Type of Entities Range:","Parent Municipality"]
[null,null,null,null,null,null,null,null,null,null,null,null,null,null,null,null,null,null,null,null,null,null,null,"Consolidated Information"]
[]
[null,null,null,null,null,null,null,null,null,null,null,null,null,null,null,null,null,null,null,null,null,null,"Date linked",17]
[null,null,null,null,null,null,null,null,null,null,null,null,null,null,null,null,null,null,null,null,null,null,"Date",{"$f":"VLOOKUP(X10,W39:X55,2)","v":"Mid-Year Assessment"},"2013-08-01"]
[]
[]
[]
[]
[]
[]
[]
[null,null,null,null,null,null,null,null,null,null,null,null,null,null,null,null,null,null,null,null,null,null,"MTREF Range:",2008]
[null,null,null,null,null,null,null,null,null,null,null,null,null,null,null,null,null,null,null,null,null,null,null,2009]
[null,null,null,null,null,null,null,null,null,null,null,null,null,null,null,null,null,null,null,null,null,null,null,2010]
[null,null,null,null,null,null,null,null,null,null,null,null,null,null,null,null,null,null,null,null,null,null,null,2011]
[null,null,null,null,null,null,null,null,null,null,null,null,null,null,null,null,null,null,null,null,null,null,null,2012]
[null,null,null,null,null,null,null,null,null,null,null,null,null,null,null,null,null,null,null,null,null,null,null,2013]
[null,null,null,null,null,null,null,null,null,null,null,null,null,null,null,null,null,null,null,null,null,null,null,2014]
[null,null,null,null,null,null,null,null,null,null,null,null,null,null,null,null,null,null,null,null,null,null,null,2015]
[null,null,null,null,null,null,null,null,null,null,null,null,null,null,null,null,null,null,null,null,null,null,null,2016]
[null,null,null,null,null,null,null,null,null,null,null,null,null,null,null,null,null,null,null,null,null,null,null,2017]
[null,null,null,null,null,null,null,null,null,null,null,null,null,null,null,null,null,null,null,null,null,null,null,2018]
[null,null,null,null,null,null,null,null,null,null,null,null,null,null,null,null,null,null,null,null,null,null,null,2019]
[null,null,null,null,null,null,null,null,null,null,null,null,null,null,null,null,null,null,null,null,null,null,null,2020]
[null,null,null,null,null,null,null,null,null,null,null,null,null,null,null,null,null,null,null,null,null,null,null,2021]
[null,null,null,null,null,null,null,null,null,null,null,null,null,null,null,null,null,null,null,null,null,null,null,2022]
[null,null,null,null,null,null,null,null,null,null,null,null,null,null,null,null,null,null,null,null,null,null,"MTREF Linked:"]
[null,null,null,null,null,null,null,null,null,null,null,null,null,null,null,null,null,null,null,null,null,null,"MTREF:",13]
[null,null,null,null,null,null,null,null,null,null,null,null,null,null,null,null,null,null,null,null,null,null,null,{"$f":"INDEX(X19:X33,X35,1)","v":2020}]
[null,null,null,null,null,null,null,null,null,null,null,null,null,null,null,null,null,null,null,null,null,null,"Fin Year:"]
[null,null,null,null,null,null,null,null,null,null,null,null,null,null,null,null,null,null,null,null,null,null,null,{"$f":"MTREF&\"/\"&RIGHT(MTREF,2)+1","v":"2020/21"}]
[null,null,null,null,null,null,null,null,null,null,null,null,null,null,null,null,null,null,null,null,null,"Date/type of report",1,"M01 July"]
[null,null,null,null,null,null,null,null,null,null,null,null,null,null,null,null,null,null,null,null,null,null,2,"M02 August"]
[null,null,null,null,null,null,null,null,null,null,null,null,null,null,null,null,null,null,null,null,null,null,3,"M03 September"]
[null,null,null,null,null,null,null,null,null,null,null,null,null,null,null,null,null,null,null,null,null,null,4,"M04 October"]
[null,null,null,null,null,null,null,null,null,null,null,null,null,null,null,null,null,null,null,null,null,null,5,"M05 November"]
[null,null,null,null,null,null,null,null,null,null,null,null,null,null,null,null,null,null,null,null,null,null,6,"M06 December"]
[null,null,null,null,null,null,null,null,null,null,null,null,null,null,null,null,null,null,null,null,null,null,7,"M07 January"]
[null,null,null,null,null,null,null,null,null,null,null,null,null,null,null,null,null,null,null,null,null,null,8,"M08 February"]
[null,null,null,null,null,null,null,null,null,null,null,null,null,null,null,null,null,null,null,null,null,null,9,"M09 March"]
[null,null,null,null,null,null,null,null,null,null,null,null,null,null,null,null,null,null,null,null,null,null,10,"M10 April"]
[null,null,null,null,null,null,null,null,null,null,null,null,null,null,null,null,null,null,null,null,null,null,11,"M11 May"]
[null,null,null,null,null,null,null,null,null,null,null,null,null,null,null,null,null,null,null,null,null,null,12,"M12 June"]
[null,null,null,null,null,null,null,null,null,null,null,null,null,null,null,null,null,null,null,null,null,null,13,"Q1 First Quarter"]
[null,null,null,null,null,null,null,null,null,null,null,null,null,null,null,null,null,null,null,null,null,null,14,"Q2 Second Quarter"]
[null,null,null,null,null,null,null,null,null,null,null,null,null,null,null,null,null,null,null,null,null,null,15,"Q3 Third Quarter"]
[null,null,null,null,null,null,null,null,null,null,null,null,null,null,null,null,null,null,null,null,null,null,16,"Q4 Fourth Quarter"]
[null,null,null,null,null,null,null,null,null,null,null,null,null,null,null,null,null,null,null,null,null,null,17,"Mid-Year Assessment"]

{"sheet":"Template names","index":2,"n_rows":107,"n_cols":6,"rows_kept":107,"cut":false,"hidden":true,"merged":[[0,0,0,3],[75,0,75,1],[71,0,71,3]]}
["Common sheet headings"]
["Head1",{"$f":"HLOOKUP(MTREF,Headings,2)","v":"2019/20"},"Prior year -1"]
["Head2",{"$f":"HLOOKUP(MTREF,Headings,5)","v":"Budget Year 2020/21"},"Year of approved budget"]
["Head2A",{"$f":"HLOOKUP(MTREF,Headings,4)","v":"2020/21"},"Approved budget year"]
["Head3",{"$f":"HLOOKUP(MTREF,Headings,3)","v":"2020/21 Medium Term Revenue & Expenditure Framework"},"MTREF header name"]
["Head5","Audited Outcome"]
["Head5A","Outcome"]
["Head5B","Pre-audit outcome"]
["Head6","Original Budget"]
["Head7","Adjusted Budget"]
["Head8","Full Year Forecast"]
["Head9",{"$f":"HLOOKUP(MTREF,Headings,5)","v":"Budget Year 2020/21"},"1st year of MTREF","Year1"]
["Head10",{"$f":"HLOOKUP(MTREF,Headings,6)","v":"Budget Year +1 2021/22"},"2nd year of MTREF","Year2"]
["Head11",{"$f":"HLOOKUP(MTREF,Headings,7)","v":"Budget Year +2 2022/23"},"3rd year of MTREF","Year3"]
["Head12","Forecast 2010/11",null,"Year4"]
["Head13","Forecast 2011/12",null,"Year5"]
["Head14","Forecast 2012/13",null,"Year6"]
["Head15","Forecast 2013/14",null,"Year7"]
["Head16","Forecast 2014/15",null,"Year8"]
["Head17","Forecast 2015/16",null,"Year9"]
["Head18","Forecast 2016/17",null,"Year10"]
["Head19","Forecast 2017/18",null,"Year11"]
["Head20","Forecast 2018/19",null,"Year12"]
["Head21","Forecast 2019/20",null,"Year13"]
["Head22","Forecast 2020/21",null,"Year14"]
["Head23","Forecast 2021/22",null,"Year15"]
["Head24","Description",null,"Desc"]
["Head25","Schedule of funding diligence",null,"fdil"]
["Head26","Vote Description",null,"VDesc"]
["Head27","Ref"]
["Head27a","References"]
["Head28","Surplus/ (Deficit) for the year",null,"Result"]
["Head29","Annual target 2007/08"]
["Head30","Revised target 2007/08"]
["Head31","Quarter ended 30 September"]
["Head32","Quarter ended 31 December"]
["Head33","Quarter ended 31 March"]
["Head34","Quarter ended 30 June"]
["Head35","Variance explanation"]
["Head36","YTD  Actual 31 Dec"]
["Head37","YTD  Budget 31 Dec"]
["Head38","Monthly actual"]
["Head39","YearTD actual"]
["Head40","YearTD budget"]
["Head41","YTD variance"]
["Head42","Surplus/ (Deficit) for the yr/period"]
["Head43",{"$f":"Head3&\" Summary\"","v":"2020/21 Medium Term Revenue & Expenditure Framework Summary"}]
["Head44","1996 Census"]
["Head45","2001 Census"]
["Head46"," - Adjustments Budget - Month YYYY"]
["Head47","Previous target year to complete"]
["Head48","Present value"]
["Head49","Virement"]
["Head50","Other Adjusts."]
["Head51","Accum. Funds"]
["Head52","Multi-year capital"]
["Head53","Unfore. Unavoid."]
["Head54","Prior Adjusted"]
["Head55","Nat. or Prov. Govt"]
["Head56","Total Adjusts."]
["Head57",{"$f":"date","v":"Mid-Year Assessment"}]
["Head58","Parent muni."]
["Head59","Downward adjusts"]
["Head60","Month","Report header part name",{"$f":"MONTH(date)","v":{"$error":"#VALUE!"}}]
["SFPerf1","Budgeted Financial Performance"]
["SFPerf2","Forecast Financial Performance"]
["SFPos1","Budgeted Financial Position"]
["SFPos2","Forecast Financial Position"]
["Cash1","Budget Cash Flow"]
["Cash2","Forecast Cash Flow"]
["RandM","Expenditure includes repairs & maintenance of R'000"]
["Standard nomenclature"]
["Muni",{"$f":"'Lookup and lists'!B27","v":"Choose name from list"}]
["Municipal Entities",2,"Type of report:",3]
[{"$f":"IF((MuniEntities=1)*(MuniType=2),\"YES\",\"NO\")","v":"NO"},"Does this municipality have entities (consolidated budget and entity budgets required)? YES/NO"]
["s71 (Monthly Mayor report) schedules and charts"]
["S71sum",{"$f":"IF(Consolques=\"YES\",E77,F77)","v":"Table C1 Monthly Budget Statement Summary"},null,"Table C1 ",{"$f":"D77&\"Consolidated Monthly Budget Statement Summary\"","v":"Table C1 Consolidated Monthly Budget Statement Summary"},{"$f":"D77&\"Monthly Budget Statement Summary\"","v":"Table C1 Monthly Budget Statement Summary"}]
["S71C","Table C3 Monthly Budget Statement - Financial Performance (revenue and expenditure by municipal vote)",null,"Table C3 ",{"$f":"D78&\"Consolidated Monthly Budget Statement - Financial Performance (revenue and expenditure by municipal vote) \"","v":"Table C3 Consolidated Monthly Budget Statement - Financial Performance (revenue and expenditure by municipal vote) "},{"$f":"D78&\"Monthly Budget Statement - Financial Performance (revenue and expenditure by municipal vote)\"","v":"Table C3 Monthly Budget Statement - Financial Performance (revenue and expenditure by municipal vote)"}]
["S71A",{"$f":"IF(Consolques=\"YES\",E79,F79)","v":"Table C2 Monthly Budget Statement - Financial Performance (functional classification)"},null,"Table C2 ",{"$f":"D79&\"Consolidated Monthly Budget Statement - Financial Performance (functional classification) \"","v":"Table C2 Consolidated Monthly Budget Statement - Financial Performance (functional classification) "},{"$f":"D79&\"Monthly Budget Statement - Financial Performance (functional classification)\"","v":"Table C2 Monthly Budget Statement - Financial Performance (functional classification)"}]
["S71B",{"$f":"IF(Consolques=\"YES\",E80,F80)","v":"Table C4 Monthly Budget Statement - Financial Performance (revenue and expenditure)"},null,"Table C4 ",{"$f":"D80&\"Consolidated Monthly Budget Statement - Financial Performance (revenue and expenditure) \"","v":"Table C4 Consolidated Monthly Budget Statement - Financial Performance (revenue and expenditure) "},{"$f":"D80&\"Monthly Budget Statement - Financial Performance (revenue and expenditure)\"","v":"Table C4 Monthly Budget Statement - Financial Performance (revenue and expenditure)"}]
["S71D",{"$f":"IF(Consolques=\"YES\",E81,F81)","v":"Table C5 Monthly Budget Statement - Capital Expenditure (municipal vote, functional classification and funding)"},null,"Table C5 ",{"$f":"D81&\"Consolidated Monthly Budget Statement - Capital Expenditure (municipal vote, functional classification and funding \"","v":"Table C5 Consolidated Monthly Budget Statement - Capital Expenditure (municipal vote, functional classification and funding "},{"$f":"D81&\"Monthly Budget Statement - Capital Expenditure (municipal vote, functional classification and funding)\"","v":"Table C5 Monthly Budget Statement - Capital Expenditure (municipal vote, functional classification and funding)"}]
["S71E","Table C6 Monthly Budget Statement - Financial Position",null,"Table C6 ",{"$f":"D82&\"Consolidated Monthly Budget Statement - Financial Position \"","v":"Table C6 Consolidated Monthly Budget Statement - Financial Position "},{"$f":"D82&\"Monthly Budget Statement - Financial Position\"","v":"Table C6 Monthly Budget Statement - Financial Position"}]
["S71F","Table C7 Monthly Budget Statement - Cash Flow ",null,"Table C7 ",{"$f":"D83&\"Consolidated Monthly Budget Statement - Cash Flow \"","v":"Table C7 Consolidated Monthly Budget Statement - Cash Flow "},{"$f":"D83&\"Monthly Budget Statement - Cash Flow \"","v":"Table C7 Monthly Budget Statement - Cash Flow "}]
["S71G",{"$f":"D84&\"Material variance explanations \"","v":"Supporting Table SC1 Material variance explanations "},null,"Supporting Table SC1 "]
["S71H",{"$f":"D85&\"Monthly Budget Statement - performance indicators  \"","v":"Supporting Table SC2 Monthly Budget Statement - performance indicators  "},null,"Supporting Table SC2 "]
["S71I",{"$f":"D86&\"Monthly Budget Statement - aged debtors\"","v":"Supporting Table SC3 Monthly Budget Statement - aged debtors"},null,"Supporting Table SC3 "]
["S71J",{"$f":"D87&\"Monthly Budget Statement - aged creditors \"","v":"Supporting Table SC4 Monthly Budget Statement - aged creditors "},null,"Supporting Table SC4 "]
["S71K",{"$f":"D88&\"Monthly Budget Statement - investment portfolio \"","v":"Supporting Table SC5 Monthly Budget Statement - investment portfolio "},null,"Supporting Table SC5 "]
["S71L",{"$f":"D89&\"Monthly Budget Statement - transfers and grant receipts \"","v":"Supporting Table SC6 Monthly Budget Statement - transfers and grant receipts "},null,"Supporting Table SC6 "]
["S71M",{"$f":"D90&\" Monthly Budget Statement - transfers and grant expenditure \"","v":"Supporting Table SC7(1) Monthly Budget Statement - transfers and grant expenditure "},null,"Supporting Table SC7(1)"]
["S71N",{"$f":"D91&\"Monthly Budget Statement - councillor and staff benefits \"","v":"Supporting Table SC8 Monthly Budget Statement - councillor and staff benefits "},null,"Supporting Table SC8 "]
["S71O",{"$f":"D92&\"Monthly Budget Statement - actuals and revised targets for cash receipts\"","v":"Supporting Table SC9 Monthly Budget Statement - actuals and revised targets for cash receipts"},null,"Supporting Table SC9 "]
["S71P",{"$f":"IF(Consolques=\"YES\",E93,F93)","v":"NOT REQUIRED - municipality does not have entities or this is the parent municipality's budget"},null,"Supporting Table SC10 ",{"$f":"D93&\"Monthly Budget Statement  - Parent Municipality Financial Performance (revenue and expenditure) \"","v":"Supporting Table SC10 Monthly Budget Statement  - Parent Municipality Financial Performance (revenue and expenditure) "},"NOT REQUIRED - municipality does not have entities or this is the parent municipality's budget"]
["S71Q","NOT REQUIRED - municipality does not have entities or this is the parent municipality's budget",null,"Supporting Table SC11 ",{"$f":"D94&\"Monthly Budget Statement - summary of municipal entities\"","v":"Supporting Table SC11 Monthly Budget Statement - summary of municipal entities"},"NOT REQUIRED - municipality does not have entities or this is the parent municipality's budget"]
["S71R","Supporting Table SC12 Monthly Budget Statement - capital expenditure trend",null,"Supporting Table SC12 ",{"$f":"D95&\"Consolidated Monthly Budget Statement - capital expenditure trend \"","v":"Supporting Table SC12 Consolidated Monthly Budget Statement - capital expenditure trend "},{"$f":"D95&\"Monthly Budget Statement - capital expenditure trend\"","v":"Supporting Table SC12 Monthly Budget Statement - capital expenditure trend"}]
["S71Sa","Supporting Table SC13a Monthly Budget Statement - capital expenditure on new assets by asset class",null,"Supporting Table SC13a ",{"$f":"D96&\"Consolidated Monthly Budget Statement - capital expenditure on new assets by asset class\"","v":"Supporting Table SC13a Consolidated Monthly Budget Statement - capital expenditure on new assets by asset class"},{"$f":"D96&\"Monthly Budget Statement - capital expenditure on new assets by asset class\"","v":"Supporting Table SC13a Monthly Budget Statement - capital expenditure on new assets by asset class"}]
["S71Sb","Supporting Table SC13b Monthly Budget Statement - capital expenditure on renewal of existing assets by asset class",null,"Supporting Table SC13b ",{"$f":"D97&\"Consolidated Monthly Budget Statement - capital expenditure on renewal of existing assets by asset class\"","v":"Supporting Table SC13b Consolidated Monthly Budget Statement - capital expenditure on renewal of existing assets by asset class"},{"$f":"D97&\"Monthly Budget Statement - capital expenditure on renewal of existing assets by asset class\"","v":"Supporting Table SC13b Monthly Budget Statement - capital expenditure on renewal of existing assets by asset class"}]
["S71Sc","Supporting Table SC13c Monthly Budget Statement - expenditure on repairs and maintenance by asset class",null,"Supporting Table SC13c ",{"$f":"D98&\"Consolidated Monthly Budget Statement - expenditure on repairs and maintenance by asset class\"","v":"Supporting Table SC13c Consolidated Monthly Budget Statement - expenditure on repairs and maintenance by asset class"},{"$f":"D98&\"Monthly Budget Statement - expenditure on repairs and maintenance by asset class\"","v":"Supporting Table SC13c Monthly Budget Statement - expenditure on repairs and maintenance by asset class"}]
["S71Sd","Supporting Table SC13d Monthly Budget Statement - depreciation by asset class",null,"Supporting Table SC13d ",{"$f":"D99&\"Consolidated Monthly Budget Statement - depreciation by asset class\"","v":"Supporting Table SC13d Consolidated Monthly Budget Statement - depreciation by asset class"},{"$f":"D99&\"Monthly Budget Statement - depreciation by asset class\"","v":"Supporting Table SC13d Monthly Budget Statement - depreciation by asset class"}]
["S71Se",{"$f":"IF(Consolques=\"YES\",E100,F100)","v":"Supporting Table SC13e Monthly Budget Statement - capital expenditure on upgrading of existing assets by asset class"},null,"Supporting Table SC13e ",{"$f":"D100&\"Consolidated Monthly Budget Statement - capital expenditure on upgrading of existing assets by asset class\"","v":"Supporting Table SC13e Consolidated Monthly Budget Statement - capital expenditure on upgrading of existing assets by asset class"},{"$f":"D100&\"Monthly Budget Statement - capital expenditure on upgrading of existing assets by asset class\"","v":"Supporting Table SC13e Monthly Budget Statement - capital expenditure on upgrading of existing assets by asset class"}]
[null,"s71 charts listing"]
[null,{"$f":"D102&Head2A&\" Capital Expenditure Monthly Trend: actual v target\"","v":"Chart C1 2020/21 Capital Expenditure Monthly Trend: actual v target"},null,"Chart C1 "]
[null,{"$f":"D103&Head2A&\" Capital Expenditure: YTD actual v YTD target\"","v":"Chart C2 2020/21 Capital Expenditure: YTD actual v YTD target"},null,"Chart C2 "]
[null,{"$f":"D104&\"Aged Consumer Debtors Analysis\"","v":"Chart C3 Aged Consumer Debtors Analysis"},null,"Chart C3 "]
[null,{"$f":"D105&\"Consumer Debtors (total by Debtor Customer Category)\"","v":"Chart C4 Consumer Debtors (total by Debtor Customer Category)"},null,"Chart C4 "]
[null,{"$f":"D106&\"Aged Creditors Analysis\"","v":"Chart C5 Aged Creditors Analysis"},null,"Chart C5 "]
["S71T",{"$f":"D107&\" Monthly Budget Statement - Expenditure against approved rollovers\"","v":"Supporting Table SC7(2) Monthly Budget Statement - Expenditure against approved rollovers"},null,"Supporting Table SC7(2)"]

{"sheet":"Lookup and lists","index":3,"n_rows":307,"n_cols":22,"rows_kept":307,"cut":false,"hidden":true,"merged":[]}
["Description",2007,2008,2009,2010,2011,2012,2013,2014,2015,2016,2017,2018,2019,2020,null,"Grants:","National - opex","Provincial - opex","National - capex","Provincial - capex","YESNO"]
[{"$f":"'Template names'!C2","v":"Prior year -1"},"2006/07","2007/08","2008/09",{"$f":"E1-1&\"/\"&RIGHT(E1,2)-0","v":"2009/10"},{"$f":"F1-1&\"/\"&RIGHT(F1,2)-0","v":"2010/11"},"2011/12","2012/13","2013/14","2014/15","2015/16","2016/17","2017/18","2018/19","2019/20",null,null,"Local Government Equitable Share","Health subsidy","Municipal Infrastructure Grant (MIG)","Agriculture","Yes"]
[{"$f":"'Template names'!C5","v":"MTREF header name"},"2007/08 Medium Term Revenue & Expenditure Framework","2008/09 Medium Term Revenue & Expenditure Framework","2009/10 Medium Term Revenue & Expenditure Framework",{"$f":"E1&\"/\"&RIGHT(E1,2)+1&\" Medium Term Revenue & Expenditure Framework\"","v":"2010/11 Medium Term Revenue & Expenditure Framework"},{"$f":"F1&\"/\"&RIGHT(F1,2)+1&\" Medium Term Revenue & Expenditure Framework\"","v":"2011/12 Medium Term Revenue & Expenditure Framework"},"2012/13 Medium Term Revenue & Expenditure Framework","2013/14 Medium Term Revenue & Expenditure Framework","2014/15 Medium Term Revenue & Expenditure Framework","2015/16 Medium Term Revenue & Expenditure Framework","2016/17 Medium Term Revenue & Expenditure Framework","2017/18 Medium Term Revenue & Expenditure Framework","2018/19 Medium Term Revenue & Expenditure Framework","2019/20 Medium Term Revenue & Expenditure Framework","2020/21 Medium Term Revenue & Expenditure Framework",null,null,"RSC Levy Replacement ","Ambulance subsidy","Public Transport and Systems","Education","No"]
[{"$f":"'Template names'!C4","v":"Approved budget year"},"2007/08","2008/09","2009/10",{"$f":"E1&\"/\"&RIGHT(E1,2)+1","v":"2010/11"},{"$f":"F1&\"/\"&RIGHT(F1,2)+1","v":"2011/12"},"2012/13","2013/14","2014/15","2015/16","2016/17","2017/18","2018/19","2019/20","2020/21",null,null,"Finance Management ","Housing","Rural Transport Services and Infrastructure","Health"]
[{"$f":"'Template names'!C12","v":"1st year of MTREF"},"Budget Year 2007/08","Budget Year 2008/09","Budget Year 2009/10",{"$f":"\"Budget Year \"&E1&\"/\"&RIGHT(E1,2)+1","v":"Budget Year 2010/11"},{"$f":"\"Budget Year \"&F1&\"/\"&RIGHT(F1,2)+1","v":"Budget Year 2011/12"},"Budget Year 2012/13","Budget Year 2013/14","Budget Year 2014/15","Budget Year 2015/16","Budget Year 2016/17","Budget Year 2017/18","Budget Year 2018/19","Budget Year 2019/20","Budget Year 2020/21",null,null,"Municipal Systems Improvement","Sport and Recreation","Regional Bulk Infrastructure","Housing and Local Government "]
[{"$f":"'Template names'!C13","v":"2nd year of MTREF"},"Budget Year +1 2008/09","Budget Year +1 2009/10","Budget Year +1 2010/11",{"$f":"\"Budget Year +1 \"&E1+1&\"/\"&RIGHT(E1,2)+2","v":"Budget Year +1 2011/12"},{"$f":"\"Budget Year +1 \"&F1+1&\"/\"&RIGHT(F1,2)+2","v":"Budget Year +1 2012/13"},"Budget Year +1 2013/14","Budget Year +1 2014/15","Budget Year +1 2015/16","Budget Year +1 2016/17","Budget Year +1 2017/18","Budget Year +1 2018/19","Budget Year +1 2019/20","Budget Year +1 2020/21","Budget Year +1 2021/22",null,null,"Water Services Operating Subsidy ",null,"Rural Households Infrastructure ","Other Departments"]
[{"$f":"'Template names'!C14","v":"3rd year of MTREF"},"Budget Year +2 2009/10","Budget Year +2 2010/11","Budget Year +2 2011/12",{"$f":"\"Budget Year +2 \"&E1+2&\"/\"&RIGHT(E1,2)+3","v":"Budget Year +2 2012/13"},{"$f":"\"Budget Year +2 \"&F1+2&\"/\"&RIGHT(F1,2)+3","v":"Budget Year +2 2013/14"},"Budget Year +2 2014/15","Budget Year +2 2015/16","Budget Year +2 2016/17","Budget Year +2 2017/18","Budget Year +2 2018/19","Budget Year +2 2019/20","Budget Year +2 2020/21","Budget Year +2 2021/22","Budget Year +2 2022/23",null,null,"Energy Efficiency  and Demand Management",null,"Neighbourhood Development Partnership","Public Works, Roads, Transport "]
["NOTE: This sheet should not be directly amended - select headings from sheet 'S'",null,null,null,null,null,null,null,null,null,null,null,null,null,null,null,null,"Integrated National Electrification Programme",null,"2010 FIFA World Cup Stadiums Development","Sport and Recreation"]
[null,null,null,null,null,null,null,null,null,null,null,null,null,null,null,null,null,"Municipal Drought Relief "]
[null,null,null,null,null,null,null,null,null,null,null,null,null,null,null,null,null,"2010 FIFA World Cup Operating"]
[null,null,null,null,null,null,null,null,null,null,null,null,null,null,null,null,null,"Electricity Demand Side Management"]
[null,null,null,null,null,null,null,null,null,null,null,null,null,null,null,null,null,"EPWP Incentive"]
[]
[]
[]
[]
[]
[]
[]
[]
[]
[]
[]
[]
[]
["Name link",1]
["Name of Muni",{"$f":"INDEX(B28:B311,B26,1)","v":"Choose name from list"}]
[null,"Choose name from list","Set name on 'Instructions' sheet"]
[null,"BUF Buffalo City","EC EASTERN CAPE"]
[null,"NMA Nelson Mandela Bay","EC EASTERN CAPE"]
[null,"EC101 Dr Beyers Naude","EC EASTERN CAPE"]
[null,"EC102 Blue Crane Route","EC EASTERN CAPE"]
[null,"EC104 Makana","EC EASTERN CAPE"]
[null,"EC105 Ndlambe","EC EASTERN CAPE"]
[null,"EC106 Sundays River Valley","EC EASTERN CAPE"]
[null,"EC108 Kouga","EC EASTERN CAPE"]
[null,"EC109 Kou-Kamma","EC EASTERN CAPE"]
[null,"DC10 Sarah Baartman","EC EASTERN CAPE"]
[null,"EC121 Mbhashe","EC EASTERN CAPE"]
[null,"EC122 Mnquma","EC EASTERN CAPE"]
[null,"EC123 Great Kei","EC EASTERN CAPE"]
[null,"EC124 Amahlathi","EC EASTERN CAPE"]
[null,"EC126 Ngqushwa","EC EASTERN CAPE"]
[null,"EC129 Raymond Mhlaba","EC EASTERN CAPE"]
[null,"DC12 Amathole","EC EASTERN CAPE"]
[null,"EC131 Inxuba Yethemba","EC EASTERN CAPE"]
[null,"EC135 Intsika Yethu","EC EASTERN CAPE"]
[null,"EC136 Emalahleni (Ec)","EC EASTERN CAPE"]
[null,"EC137 Engcobo","EC EASTERN CAPE"]
[null,"EC138 Sakhisizwe","EC EASTERN CAPE"]
[null,"EC139 Enoch Mgijima","EC EASTERN CAPE"]
[null,"DC13 Chris Hani","EC EASTERN CAPE"]
[null,"EC141 Elundini","EC EASTERN CAPE"]
[null,"EC142 Senqu","EC EASTERN CAPE"]
[null,"EC145 Walter Sisulu","EC EASTERN CAPE"]
[null,"DC14 Joe Gqabi","EC EASTERN CAPE"]
[null,"EC153 Ngquza Hills","EC EASTERN CAPE"]
[null,"EC154 Port St Johns","EC EASTERN CAPE"]
[null,"EC155 Nyandeni","EC EASTERN CAPE"]
[null,"EC156 Mhlontlo","EC EASTERN CAPE"]
[null,"EC157 King Sabata Dalindyebo","EC EASTERN CAPE"]
[null,"DC15 O .R. Tambo","EC EASTERN CAPE"]
[null,"EC441 Matatiele","EC EASTERN CAPE"]
[null,"EC442 Umzimvubu","EC EASTERN CAPE"]
[null,"EC443 Mbizana","EC EASTERN CAPE"]
[null,"EC444 Ntabankulu","EC EASTERN CAPE"]
[null,"DC44 Alfred Nzo","EC EASTERN CAPE"]
[null,"MAN Mangaung","FS FREE STATE"]
[null,"FS161 Letsemeng","FS FREE STATE"]
[null,"FS162 Kopanong","FS FREE STATE"]
[null,"FS163 Mohokare","FS FREE STATE"]
[null,"DC16 Xhariep","FS FREE STATE"]
[null,"FS181 Masilonyana","FS FREE STATE"]
[null,"FS182 Tokologo","FS FREE STATE"]
[null,"FS183 Tswelopele","FS FREE STATE"]
[null,"FS184 Matjhabeng","FS FREE STATE"]
[null,"FS185 Nala","FS FREE STATE"]
[null,"DC18 Lejweleputswa","FS FREE STATE"]
[null,"FS191 Setsoto","FS FREE STATE"]
[null,"FS192 Dihlabeng","FS FREE STATE"]
[null,"FS193 Nketoana","FS FREE STATE"]
[null,"FS194 Maluti-a-Phofung","FS FREE STATE"]
[null,"FS195 Phumelela","FS FREE STATE"]
[null,"FS196 Mantsopa","FS FREE STATE"]
[null,"DC19 Thabo Mofutsanyana","FS FREE STATE"]
[null,"FS201 Moqhaka","FS FREE STATE"]
[null,"FS203 Ngwathe","FS FREE STATE"]
[null,"FS204 Metsimaholo","FS FREE STATE"]
[null,"FS205 Mafube","FS FREE STATE"]
[null,"DC20 Fezile Dabi","FS FREE STATE"]
[null,"EKU City of Ekurhuleni","GT GAUTENG"]
[null,"JHB City Of Johannesburg","GT GAUTENG"]
[null,"TSH City Of Tshwane","GT GAUTENG"]
[null,"GT421 Emfuleni","GT GAUTENG"]
[null,"GT422 Midvaal","GT GAUTENG"]
[null,"GT423 Lesedi","GT GAUTENG"]
[null,"DC42 Sedibeng","GT GAUTENG"]
[null,"GT481 Mogale City","GT GAUTENG"]
[null,"GT484 Merafong City","GT GAUTENG"]
[null,"GT485 Rand West City","GT GAUTENG"]
[null,"DC48 West Rand","GT GAUTENG"]
[null,"ETH eThekwini","KZN KWAZULU-NATAL"]
[null,"KZN212 Umdoni","KZN KWAZULU-NATAL"]
[null,"KZN213 Umzumbe","KZN KWAZULU-NATAL"]
[null,"KZN214 uMuziwabantu","KZN KWAZULU-NATAL"]
[null,"KZN216 Ray Nkonyeni","KZN KWAZULU-NATAL"]
[null,"DC21 Ugu","KZN KWAZULU-NATAL"]
[null,"KZN221 uMshwathi","KZN KWAZULU-NATAL"]
[null,"KZN222 uMngeni","KZN KWAZULU-NATAL"]
[null,"KZN223 Mpofana","KZN KWAZULU-NATAL"]
[null,"KZN224 Impendle","KZN KWAZULU-NATAL"]
[null,"KZN225 Msunduzi","KZN KWAZULU-NATAL"]
[null,"KZN226 Mkhambathini","KZN KWAZULU-NATAL"]
[null,"KZN227 Richmond","KZN KWAZULU-NATAL"]
[null,"DC22 uMgungundlovu","KZN KWAZULU-NATAL"]
[null,"KZN235 Okhahlamba","KZN KWAZULU-NATAL"]
[null,"KZN237 Inkosi Langalibalele","KZN KWAZULU-NATAL"]
[null,"KZN238 Alfred Duma","KZN KWAZULU-NATAL"]
[null,"DC23 Uthukela","KZN KWAZULU-NATAL"]
[null,"KZN241 Endumeni","KZN KWAZULU-NATAL"]
[null,"KZN242 Nquthu","KZN KWAZULU-NATAL"]
[null,"KZN244 Msinga","KZN KWAZULU-NATAL"]
[null,"KZN245 Umvoti","KZN KWAZULU-NATAL"]
[null,"DC24 Umzinyathi","KZN KWAZULU-NATAL"]
[null,"KZN252 Newcastle","KZN KWAZULU-NATAL"]
[null,"KZN253 Emadlangeni","KZN KWAZULU-NATAL"]
[null,"KZN254 Dannhauser","KZN KWAZULU-NATAL"]
[null,"DC25 Amajuba","KZN KWAZULU-NATAL"]
[null,"KZN261 eDumbe","KZN KWAZULU-NATAL"]
[null,"KZN262 uPhongolo","KZN KWAZULU-NATAL"]
[null,"KZN263 Abaqulusi","KZN KWAZULU-NATAL"]
[null,"KZN265 Nongoma","KZN KWAZULU-NATAL"]
[null,"KZN266 Ulundi","KZN KWAZULU-NATAL"]
[null,"DC26 Zululand","KZN KWAZULU-NATAL"]
[null,"KZN271 Umhlabuyalingana","KZN KWAZULU-NATAL"]
[null,"KZN272 Jozini","KZN KWAZULU-NATAL"]
[null,"KZN275 Mtubatuba","KZN KWAZULU-NATAL"]
[null,"KZN276 Hlabisa Big Five","KZN KWAZULU-NATAL"]
[null,"DC27 Umkhanyakude","KZN KWAZULU-NATAL"]
[null,"KZN281 Mfolozi","KZN KWAZULU-NATAL"]
[null,"KZN282 uMhlathuze","KZN KWAZULU-NATAL"]
[null,"KZN284 uMlalazi","KZN KWAZULU-NATAL"]
[null,"KZN285 Mthonjaneni","KZN KWAZULU-NATAL"]
[null,"KZN286 Nkandla","KZN KWAZULU-NATAL"]
[null,"DC28 King Cetshwayo","KZN KWAZULU-NATAL"]
[null,"KZN291 Mandeni","KZN KWAZULU-NATAL"]
[null,"KZN292 KwaDukuza","KZN KWAZULU-NATAL"]
[null,"KZN293 Ndwedwe","KZN KWAZULU-NATAL"]
[null,"KZN294 Maphumulo","KZN KWAZULU-NATAL"]
[null,"DC29 iLembe","KZN KWAZULU-NATAL"]
[null,"KZN433 Greater Kokstad","KZN KWAZULU-NATAL"]
[null,"KZN434 Ubuhlebezwe","KZN KWAZULU-NATAL"]
[null,"KZN435 Umzimkhulu","KZN KWAZULU-NATAL"]
[null,"KZN436 Dr Nkosazana Dlamini Zuma","KZN KWAZULU-NATAL"]
[null,"DC43 Harry Gwala","KZN KWAZULU-NATAL"]
[null,"LIM331 Greater Giyani","LIM LIMPOPO"]
[null,"LIM332 Greater Letaba","LIM LIMPOPO"]
[null,"LIM333 Greater Tzaneen","LIM LIMPOPO"]
[null,"LIM334 Ba-Phalaborwa","LIM LIMPOPO"]
[null,"LIM335 Maruleng","LIM LIMPOPO"]
[null,"DC33 Mopani","LIM LIMPOPO"]
[null,"LIM341 Musina","LIM LIMPOPO"]
[null,"LIM343 Thulamela","LIM LIMPOPO"]
[null,"LIM344 Makhado","LIM LIMPOPO"]
[null,"LIM345 Collins Chabane","LIM LIMPOPO"]
[null,"DC34 Vhembe","LIM LIMPOPO"]
[null,"LIM351 Blouberg","LIM LIMPOPO"]
[null,"LIM353 Molemole","LIM LIMPOPO"]
[null,"LIM354 Polokwane","LIM LIMPOPO"]
[null,"LIM355 Lepelle-Nkumpi","LIM LIMPOPO"]
[null,"DC35 Capricorn","LIM LIMPOPO"]
[null,"LIM361 Thabazimbi","LIM LIMPOPO"]
[null,"LIM362 Lephalale","LIM LIMPOPO"]
[null,"LIM366 Bela Bela","LIM LIMPOPO"]
[null,"LIM367 Mogalakwena","LIM LIMPOPO"]
[null,"LIM368 Modimolle-Mookgopong","LIM LIMPOPO"]
[null,"DC36 Waterberg","LIM LIMPOPO"]
[null,"LIM471 Ephraim Mogale","LIM LIMPOPO"]
[null,"LIM472 Elias Motsoaledi","LIM LIMPOPO"]
[null,"LIM473 Makhuduthamaga","LIM LIMPOPO"]
[null,"LIM476 Tubatse Fetakgomo","LIM LIMPOPO"]
[null,"DC47 Sekhukhune","LIM LIMPOPO"]
[null,"MP301 Albert Luthuli","MP MPUMALANGA"]
[null,"MP302 Msukaligwa","MP MPUMALANGA"]
[null,"MP303 Mkhondo","MP MPUMALANGA"]
[null,"MP304 Pixley Ka Seme (MP)","MP MPUMALANGA"]
[null,"MP305 Lekwa","MP MPUMALANGA"]
[null,"MP306 Dipaleseng","MP MPUMALANGA"]
[null,"MP307 Govan Mbeki","MP MPUMALANGA"]
[null,"DC30 Gert Sibande","MP MPUMALANGA"]
[null,"MP311 Victor Khanye","MP MPUMALANGA"]
[null,"MP312 Emalahleni (Mp)","MP MPUMALANGA"]
[null,"MP313 Steve Tshwete","MP MPUMALANGA"]
[null,"MP314 Emakhazeni","MP MPUMALANGA"]
[null,"MP315 Thembisile Hani","MP MPUMALANGA"]
[null,"MP316 Dr J.S. Moroka","MP MPUMALANGA"]
[null,"DC31 Nkangala","MP MPUMALANGA"]
[null,"MP321 Thaba Chweu","MP MPUMALANGA"]
[null,"MP324 Nkomazi","MP MPUMALANGA"]
[null,"MP325 Bushbuckridge","MP MPUMALANGA"]
[null,"MP326 City of Mbombela","MP MPUMALANGA"]
[null,"DC32 Ehlanzeni","MP MPUMALANGA"]
[null,"NC451 Joe Morolong","NC NORTHERN CAPE"]
[null,"NC452 Ga-Segonyana","NC NORTHERN CAPE"]
[null,"NC453 Gamagara","NC NORTHERN CAPE"]
[null,"DC45 John Taolo Gaetsewe","NC NORTHERN CAPE"]
[null,"NC061 Richtersveld","NC NORTHERN CAPE"]
[null,"NC062 Nama Khoi","NC NORTHERN CAPE"]
[null,"NC064 Kamiesberg","NC NORTHERN CAPE"]
[null,"NC065 Hantam","NC NORTHERN CAPE"]
[null,"NC066 Karoo Hoogland","NC NORTHERN CAPE"]
[null,"NC067 Khai-Ma","NC NORTHERN CAPE"]
[null,"DC6 Namakwa","NC NORTHERN CAPE"]
[null,"NC071 Ubuntu","NC NORTHERN CAPE"]
[null,"NC072 Umsobomvu","NC NORTHERN CAPE"]
[null,"NC073 Emthanjeni","NC NORTHERN CAPE"]
[null,"NC074 Kareeberg","NC NORTHERN CAPE"]
[null,"NC075 Renosterberg","NC NORTHERN CAPE"]
[null,"NC076 Thembelihle","NC NORTHERN CAPE"]
[null,"NC077 Siyathemba","NC NORTHERN CAPE"]
[null,"NC078 Siyancuma","NC NORTHERN CAPE"]
[null,"DC7 Pixley Ka Seme (Nc)","NC NORTHERN CAPE"]
[null,"NC082 !Kai! Garib","NC NORTHERN CAPE"]
[null,"NC084 !Kheis","NC NORTHERN CAPE"]
[null,"NC085 Tsantsabane","NC NORTHERN CAPE"]
[null,"NC086 Kgatelopele","NC NORTHERN CAPE"]
[null,"NC087 Dawid Kruiper","NC NORTHERN CAPE"]
[null,"DC8 Z F Mgcawu","NC NORTHERN CAPE"]
[null,"NC091 Sol Plaatje","NC NORTHERN CAPE"]
[null,"NC092 Dikgatlong","NC NORTHERN CAPE"]
[null,"NC093 Magareng","NC NORTHERN CAPE"]
[null,"NC094 Phokwane","NC NORTHERN CAPE"]
[null,"DC9 Frances Baard","NC NORTHERN CAPE"]
[null,"NW371 Moretele","NW NORTH WEST"]
[null,"NW372 Madibeng","NW NORTH WEST"]
[null,"NW373 Rustenburg","NW NORTH WEST"]
[null,"NW374 Kgetlengrivier","NW NORTH WEST"]
[null,"NW375 Moses Kotane","NW NORTH WEST"]
[null,"DC37 Bojanala Platinum","NW NORTH WEST"]
[null,"NW381 Ratlou","NW NORTH WEST"]
[null,"NW382 Tswaing","NW NORTH WEST"]
[null,"NW383 Mafikeng","NW NORTH WEST"]
[null,"NW384 Ditsobotla","NW NORTH WEST"]
[null,"NW385 Ramotshere Moiloa","NW NORTH WEST"]
[null,"DC38 Ngaka Modiri Molema","NW NORTH WEST"]
[null,"NW392 Naledi (Nw)","NW NORTH WEST"]
[null,"NW393 Mamusa","NW NORTH WEST"]
[null,"NW394 Greater Taung","NW NORTH WEST"]
[null,"NW396 Lekwa-Teemane","NW NORTH WEST"]
[null,"NW397 Kagisano-Molopo","NW NORTH WEST"]
[null,"DC39 Dr Ruth Segomotsi Mompati","NW NORTH WEST"]
[null,"NW403 City Of Matlosana","NW NORTH WEST"]
[null,"NW404 Maquassi Hills","NW NORTH WEST"]
[null,"NW405 J B Marks","NW NORTH WEST"]
[null,"DC40 Dr Kenneth Kaunda","NW NORTH WEST"]
[null,"CPT Cape Town","WC WESTERN CAPE"]
[null,"WC011 Matzikama","WC WESTERN CAPE"]
[null,"WC012 Cederberg","WC WESTERN CAPE"]
[null,"WC013 Bergrivier","WC WESTERN CAPE"]
[null,"WC014 Saldanha Bay","WC WESTERN CAPE"]
[null,"WC015 Swartland","WC WESTERN CAPE"]
[null,"DC1 West Coast","WC WESTERN CAPE"]
[null,"WC022 Witzenberg","WC WESTERN CAPE"]
[null,"WC023 Drakenstein","WC WESTERN CAPE"]
[null,"WC024 Stellenbosch","WC WESTERN CAPE"]
[null,"WC025 Breede Valley","WC WESTERN CAPE"]
[null,"WC026 Langeberg","WC WESTERN CAPE"]
[null,"DC2 Cape Winelands DM","WC WESTERN CAPE"]
[null,"WC031 Theewaterskloof","WC WESTERN CAPE"]
[null,"WC032 Overstrand","WC WESTERN CAPE"]
[null,"WC033 Cape Agulhas","WC WESTERN CAPE"]
[null,"WC034 Swellendam","WC WESTERN CAPE"]
[null,"DC3 Overberg","WC WESTERN CAPE"]
[null,"WC041 Kannaland","WC WESTERN CAPE"]
[null,"WC042 Hessequa","WC WESTERN CAPE"]
[null,"WC043 Mossel Bay","WC WESTERN CAPE"]
[null,"WC044 George","WC WESTERN CAPE"]
[null,"WC045 Oudtshoorn","WC WESTERN CAPE"]
[null,"WC047 Bitou","WC WESTERN CAPE"]
[null,"WC048 Knysna","WC WESTERN CAPE"]
[null,"DC4 Garden Route","WC WESTERN CAPE"]
[null,"WC051 Laingsburg","WC WESTERN CAPE"]
[null,"WC052 Prince Albert","WC WESTERN CAPE"]
[null,"WC053 Beaufort West","WC WESTERN CAPE"]
[null,"DC5 Central Karoo","WC WESTERN CAPE"]
[]
[]
[]
[]
[]
[]
[]
[]
[]
[]
[]
[]
[]
[]
[]
[]
[]
[]
[]
[]
[]
[null,null,{"$f":"COUNTA(C29:C306)","v":257}]

{"sheet":"Org structure","index":4,"n_rows":166,"n_cols":5,"rows_kept":166,"cut":false,"hidden":false,"merged":[]}
["Organisational Structure Votes",null,"Organisational Structure Sub-Votes",null,"Display Sub-Votes"]
["Vote 1 - Finance and Administration","Vote 1","Finance and Administration"]
["Vote 2 - Finance and Administration2",1.1000000000000001,"Finance",{"$f":"CONCATENATE(B3, \" - \", C3)","v":"1.1 - Finance"},"1.1 - Finance"]
["Vote 3 - Executive and Council",1.2,"Fleet Management","1.2 - Fleet Management","1.2 - Fleet Management"]
["Vote 4 - Community and Social Services",1.3,"Asset Management","1.3 - Asset Management","1.3 - Asset Management"]
["Vote 5 - Community and Social Services2",1.4,"Administrative and Corporate Support","1.4 - Administrative and Corporate Support","1.4 - Administrative and Corporate Support"]
["Vote 6 - Energy Sources",1.5,"Human Resources","1.5 - Human Resources","1.5 - Human Resources"]
["Vote 7 - Road Transport",1.6,"Property Services","1.6 - Property Services","1.6 - Property Services"]
["Vote 8 - Planning and Development",1.7,"Legal Services","1.7 - Legal Services","1.7 - Legal Services"]
["Vote 9 - Sport and Recreation",1.8,"Information Technology","1.8 - Information Technology","1.8 - Information Technology"]
["Vote 10 - Public Safety",1.9,"Marketing, Customer Relations, Publicity and Media Co-ordination","1.9 - Marketing, Customer Relations, Publicity and Media Co-ordination","1.9 - Marketing, Customer Relations, Publicity and Media Co-ordination"]
["Vote 11 - Other","1.10","Valuation Service","1.10 - Valuation Service","1.10 - Valuation Service"]
["Vote 12 - Waste Management","Vote 2","Finance and Administration2"]
["Vote 13 - Housing",2.1,"Supply Chain Management",{"$f":"CONCATENATE(B14, \" - \", C14)","v":"2.1 - Supply Chain Management"},"2.1 - Supply Chain Management"]
["Vote 14 - Waste Water Management",2.2000000000000002,"[Name of sub-vote]","2.2 - [Name of sub-vote]"]
["Vote 15 - Health",2.2999999999999998,"[Name of sub-vote]","2.3 - [Name of sub-vote]"]
[null,2.4,"[Name of sub-vote]","2.4 - [Name of sub-vote]"]
[null,2.5,"[Name of sub-vote]","2.5 - [Name of sub-vote]"]
[null,2.6,"[Name of sub-vote]","2.6 - [Name of sub-vote]"]
[null,2.7,"[Name of sub-vote]","2.7 - [Name of sub-vote]"]
[null,2.8,"[Name of sub-vote]","2.8 - [Name of sub-vote]"]
[null,2.9,"[Name of sub-vote]","2.9 - [Name of sub-vote]"]
[null,"2.10","[Name of sub-vote]","2.10 - [Name of sub-vote]"]
[null,"Vote 3","Executive and Council"]
[null,3.1,"Municipal Manager, Town Secretary and Chief Executive",{"$f":"CONCATENATE(B25, \" - \", C25)","v":"3.1 - Municipal Manager, Town Secretary and Chief Executive"},"3.1 - Municipal Manager, Town Secretary and Chief Executive"]
[null,3.2,"Mayor and Council","3.2 - Mayor and Council","3.2 - Mayor and Council"]
[null,3.3,"[Name of sub-vote]","3.3 - [Name of sub-vote]"]
[null,3.4,"[Name of sub-vote]","3.4 - [Name of sub-vote]"]
[null,3.5,"[Name of sub-vote]","3.5 - [Name of sub-vote]"]
[null,3.6,"[Name of sub-vote]","3.6 - [Name of sub-vote]"]
[null,3.7,"[Name of sub-vote]","3.7 - [Name of sub-vote]"]
[null,3.8,"[Name of sub-vote]","3.8 - [Name of sub-vote]"]
[null,3.9,"[Name of sub-vote]","3.9 - [Name of sub-vote]"]
[null,"3.10","[Name of sub-vote]","3.10 - [Name of sub-vote]"]
[null,"Vote 4","Community and Social Services"]
[null,4.0999999999999996,"Disaster Management",{"$f":"CONCATENATE(B36, \" - \", C36)","v":"4.1 - Disaster Management"},"4.1 - Disaster Management"]
[null,4.2,"Libraries and Archives","4.2 - Libraries and Archives","4.2 - Libraries and Archives"]
[null,4.3,"Population Development","4.3 - Population Development","4.3 - Population Development"]
[null,4.4000000000000004,"Cultural Matters","4.4 - Cultural Matters","4.4 - Cultural Matters"]
[null,4.5,"Indigenous and Customary Law","4.5 - Indigenous and Customary Law","4.5 - Indigenous and Customary Law"]
[null,4.5999999999999996,"Industrial Promotion","4.6 - Industrial Promotion","4.6 - Industrial Promotion"]
[null,4.7,"Agricultural","4.7 - Agricultural","4.7 - Agricultural"]
[null,4.8,"Aged Care","4.8 - Aged Care","4.8 - Aged Care"]
[null,4.9000000000000004,"Child Care Facilities","4.9 - Child Care Facilities","4.9 - Child Care Facilities"]
[null,"4.10","Animal Care and Diseases","4.10 - Animal Care and Diseases","4.10 - Animal Care and Diseases"]
[null,"Vote 5","Community and Social Services2"]
[null,5.0999999999999996,"Literacy Programmes",{"$f":"CONCATENATE(B47, \" - \", C47)","v":"5.1 - Literacy Programmes"},"5.1 - Literacy Programmes"]
[null,5.2,"Education","5.2 - Education","5.2 - Education"]
[null,5.3,"Community Halls and Facilities","5.3 - Community Halls and Facilities","5.3 - Community Halls and Facilities"]
[null,5.4,"[Name of sub-vote]","5.4 - [Name of sub-vote]"]
[null,5.5,"[Name of sub-vote]","5.5 - [Name of sub-vote]"]
[null,5.6,"[Name of sub-vote]","5.6 - [Name of sub-vote]"]
[null,5.7,"[Name of sub-vote]","5.7 - [Name of sub-vote]"]
[null,5.8,"[Name of sub-vote]","5.8 - [Name of sub-vote]"]
[null,5.9,"[Name of sub-vote]","5.9 - [Name of sub-vote]"]
[null,"5.10","[Name of sub-vote]","5.10 - [Name of sub-vote]"]
[null,"Vote 6","Energy Sources"]
[null,6.1,"Electricity",{"$f":"CONCATENATE(B58, \" - \", C58)","v":"6.1 - Electricity"},"6.1 - Electricity"]
[null,6.2,"[Name of sub-vote]","6.2 - [Name of sub-vote]"]
[null,6.3,"[Name of sub-vote]","6.3 - [Name of sub-vote]"]
[null,6.4,"[Name of sub-vote]","6.4 - [Name of sub-vote]"]
[null,6.5,"[Name of sub-vote]","6.5 - [Name of sub-vote]"]
[null,6.6,"[Name of sub-vote]","6.6 - [Name of sub-vote]"]
[null,6.7,"[Name of sub-vote]","6.7 - [Name of sub-vote]"]
[null,6.8,"[Name of sub-vote]","6.8 - [Name of sub-vote]"]
[null,6.9,"[Name of sub-vote]","6.9 - [Name of sub-vote]"]
[null,"6.10","[Name of sub-vote]","6.10 - [Name of sub-vote]"]
[null,"Vote 7","Road Transport"]
[null,7.1,"Roads",{"$f":"CONCATENATE(B69, \" - \", C69)","v":"7.1 - Roads"},"7.1 - Roads"]
[null,7.2,"[Name of sub-vote]","7.2 - [Name of sub-vote]"]
[null,7.3,"[Name of sub-vote]","7.3 - [Name of sub-vote]"]
[null,7.4,"[Name of sub-vote]","7.4 - [Name of sub-vote]"]
[null,7.5,"[Name of sub-vote]","7.5 - [Name of sub-vote]"]
[null,7.6,"[Name of sub-vote]","7.6 - [Name of sub-vote]"]
[null,7.7,"[Name of sub-vote]","7.7 - [Name of sub-vote]"]
[null,7.8,"[Name of sub-vote]","7.8 - [Name of sub-vote]"]
[null,7.9,"[Name of sub-vote]","7.9 - [Name of sub-vote]"]
[null,"7.10","[Name of sub-vote]","7.10 - [Name of sub-vote]"]
[null,"Vote 8","Planning and Development"]
[null,8.1,"Town Planning, Building Regulations and Enforcement, and City Engineer",{"$f":"CONCATENATE(B80, \" - \", C80)","v":"8.1 - Town Planning, Building Regulations and Enforcement, and City Engineer"},"8.1 - Town Planning, Building Regulations and Enforcement, and City Engineer"]
[null,8.1999999999999993,"Development Facilitation","8.2 - Development Facilitation","8.2 - Development Facilitation"]
[null,8.3000000000000007,"Economic Development/Planning","8.3 - Economic Development/Planning","8.3 - Economic Development/Planning"]
[null,8.4,"Regional Planning and Development","8.4 - Regional Planning and Development","8.4 - Regional Planning and Development"]
[null,8.5,"Corporate Wide Strategic Planning (IDPs, LEDs)","8.5 - Corporate Wide Strategic Planning (IDPs, LEDs)","8.5 - Corporate Wide Strategic Planning (IDPs, LEDs)"]
[null,8.6,"Project Management Unit","8.6 - Project Management Unit","8.6 - Project Management Unit"]
[null,8.6999999999999993,"[Name of sub-vote]","8.7 - [Name of sub-vote]"]
[null,8.8000000000000007,"[Name of sub-vote]","8.8 - [Name of sub-vote]"]
[null,8.9,"[Name of sub-vote]","8.9 - [Name of sub-vote]"]
[null,"8.10","[Name of sub-vote]","8.10 - [Name of sub-vote]"]
[null,"Vote 9","Sport and Recreation"]
[null,9.1,"Sports Grounds and Stadiums",{"$f":"CONCATENATE(B91, \" - \", C91)","v":"9.1 - Sports Grounds and Stadiums"},"9.1 - Sports Grounds and Stadiums"]
[null,9.1999999999999993,"[Name of sub-vote]","9.2 - [Name of sub-vote]"]
[null,9.3000000000000007,"[Name of sub-vote]","9.3 - [Name of sub-vote]"]
[null,9.4,"[Name of sub-vote]","9.4 - [Name of sub-vote]"]
[null,9.5,"[Name of sub-vote]","9.5 - [Name of sub-vote]"]
[null,9.6,"[Name of sub-vote]","9.6 - [Name of sub-vote]"]
[null,9.6999999999999993,"[Name of sub-vote]","9.7 - [Name of sub-vote]"]
[null,9.8000000000000007,"[Name of sub-vote]","9.8 - [Name of sub-vote]"]
[null,9.9,"[Name of sub-vote]","9.9 - [Name of sub-vote]"]
[null,"9.10","[Name of sub-vote]","9.10 - [Name of sub-vote]"]
[null,"Vote 10","Public Safety"]
[null,10.1,"Fire Fighting and Protection",{"$f":"CONCATENATE(B102, \" - \", C102)","v":"10.1 - Fire Fighting and Protection"},"10.1 - Fire Fighting and Protection"]
[null,10.199999999999999,"Fencing and Fences","10.2 - Fencing and Fences","10.2 - Fencing and Fences"]
[null,10.3,"[Name of sub-vote]","10.3 - [Name of sub-vote]"]
[null,10.4,"[Name of sub-vote]","10.4 - [Name of sub-vote]"]
[null,10.5,"[Name of sub-vote]","10.5 - [Name of sub-vote]"]
[null,10.6,"[Name of sub-vote]","10.6 - [Name of sub-vote]"]
[null,10.7,"[Name of sub-vote]","10.7 - [Name of sub-vote]"]
[null,10.8,"[Name of sub-vote]","10.8 - [Name of sub-vote]"]
[null,10.9,"[Name of sub-vote]","10.9 - [Name of sub-vote]"]
[null,"10.10","[Name of sub-vote]","10.10 - [Name of sub-vote]"]
[null,"Vote 11","Other"]
[null,11.1,"Licensing and Regulation",{"$f":"CONCATENATE(B113, \" - \", C113)","v":"11.1 - Licensing and Regulation"},"11.1 - Licensing and Regulation"]
[null,11.2,"[Name of sub-vote]","11.2 - [Name of sub-vote]"]
[null,11.3,"[Name of sub-vote]","11.3 - [Name of sub-vote]"]
[null,11.4,"[Name of sub-vote]","11.4 - [Name of sub-vote]"]
[null,11.5,"[Name of sub-vote]","11.5 - [Name of sub-vote]"]
[null,11.6,"[Name of sub-vote]","11.6 - [Name of sub-vote]"]
[null,11.7,"[Name of sub-vote]","11.7 - [Name of sub-vote]"]
[null,11.8,"[Name of sub-vote]","11.8 - [Name of sub-vote]"]
[null,11.9,"[Name of sub-vote]","11.9 - [Name of sub-vote]"]
[null,"11.10","[Name of sub-vote]","11.10 - [Name of sub-vote]"]
[null,"Vote 12","Waste Management"]
[null,12.1,"Solid Waste Removal",{"$f":"CONCATENATE(B124, \" - \", C124)","v":"12.1 - Solid Waste Removal"},"12.1 - Solid Waste Removal"]
[null,12.2,"Street Cleaning","12.2 - Street Cleaning","12.2 - Street Cleaning"]
[null,12.3,"Solid Waste Disposal (Landfill Sites)","12.3 - Solid Waste Disposal (Landfill Sites)","12.3 - Solid Waste Disposal (Landfill Sites)"]
[null,12.4,"[Name of sub-vote]","12.4 - [Name of sub-vote]"]
[null,12.5,"[Name of sub-vote]","12.5 - [Name of sub-vote]"]
[null,12.6,"[Name of sub-vote]","12.6 - [Name of sub-vote]"]
[null,12.7,"[Name of sub-vote]","12.7 - [Name of sub-vote]"]
[null,12.8,"[Name of sub-vote]","12.8 - [Name of sub-vote]"]
[null,12.9,"[Name of sub-vote]","12.9 - [Name of sub-vote]"]
[null,"12.10","[Name of sub-vote]","12.10 - [Name of sub-vote]"]
[null,"Vote 13","Housing"]
[null,13.1,"Housing",{"$f":"CONCATENATE(B135, \" - \", C135)","v":"13.1 - Housing"},"13.1 - Housing"]
[null,13.2,"[Name of sub-vote]","13.2 - [Name of sub-vote]"]
[null,13.3,"[Name of sub-vote]","13.3 - [Name of sub-vote]"]
[null,13.4,"[Name of sub-vote]","13.4 - [Name of sub-vote]"]
[null,13.5,"[Name of sub-vote]","13.5 - [Name of sub-vote]"]
[null,13.6,"[Name of sub-vote]","13.6 - [Name of sub-vote]"]
[null,13.7,"[Name of sub-vote]","13.7 - [Name of sub-vote]"]
[null,13.8,"[Name of sub-vote]","13.8 - [Name of sub-vote]"]
[null,13.9,"[Name of sub-vote]","13.9 - [Name of sub-vote]"]
[null,"13.10","[Name of sub-vote]","13.10 - [Name of sub-vote]"]
[null,"Vote 14","Waste Water Management"]
[null,14.1,"Storm Water Management",{"$f":"CONCATENATE(B146, \" - \", C146)","v":"14.1 - Storm Water Management"},"14.1 - Storm Water Management"]
[null,14.2,"[Name of sub-vote]","14.2 - [Name of sub-vote]"]
[null,14.3,"[Name of sub-vote]","14.3 - [Name of sub-vote]"]
[null,14.4,"[Name of sub-vote]","14.4 - [Name of sub-vote]"]
[null,14.5,"[Name of sub-vote]","14.5 - [Name of sub-vote]"]
[null,14.6,"[Name of sub-vote]","14.6 - [Name of sub-vote]"]
[null,14.7,"[Name of sub-vote]","14.7 - [Name of sub-vote]"]
[null,14.8,"[Name of sub-vote]","14.8 - [Name of sub-vote]"]
[null,14.9,"[Name of sub-vote]","14.9 - [Name of sub-vote]"]
[null,"14.10","[Name of sub-vote]","14.10 - [Name of sub-vote]"]
[null,"Vote 15","Health"]
[null,15.1,"Health Services",{"$f":"CONCATENATE(B157, \" - \", C157)","v":"15.1 - Health Services"},"15.1 - Health Services"]
[null,15.2,"Tourism","15.2 - Tourism","15.2 - Tourism"]
[null,15.3,"[Name of sub-vote]","15.3 - [Name of sub-vote]"]
[null,15.4,"[Name of sub-vote]","15.4 - [Name of sub-vote]"]
[null,15.5,"[Name of sub-vote]","15.5 - [Name of sub-vote]"]
[null,15.6,"[Name of sub-vote]","15.6 - [Name of sub-vote]"]
[null,15.7,"[Name of sub-vote]","15.7 - [Name of sub-vote]"]
[null,15.8,"[Name of sub-vote]","15.8 - [Name of sub-vote]"]
[null,15.9,"[Name of sub-vote]","15.9 - [Name of sub-vote]"]
[null,"15.10","[Name of sub-vote]","15.10 - [Name of sub-vote]"]

{"sheet":"Contacts","index":5,"n_rows":140,"n_cols":4,"rows_kept":140,"cut":false,"hidden":false,"merged":[[58,2,58,3],[67,2,67,3],[76,0,76,1],[76,2,76,3],[30,2,30,3],[39,0,39,1],[39,2,39,3],[48,0,48,1],[48,2,48,3],[57,0,57,1],[57,2,57,3],[7,2,7,3],[10,2,10,3],[12,2,12,3],[13,0,13,1],[29,0,29,1],[29,2,29,3],[84,0,84,1],[84,2,84,3],[92,0,92,1],[92,2,92,3],[100,0,100,1],[100,2,100,3],[132,0,132,1],[132,2,132,3],[108,0,108,1],[108,2,108,3],[116,0,116,1],[116,2,116,3],[124,0,124,1],[124,2,124,3]]}
[{"$f":"muni&\" - \"&\" Contact Information\"","v":"Choose name from list -  Contact Information"}]
[]
["A. GENERAL INFORMATION"]
["Municipality","KZN226 Mkhambathini","Set name on 'Instructions' sheet"]
[]
["Grade",null,"1 Grade in terms of the Remuneration of Public Office Bearers Act."]
[]
["Province",{"$f":"IF(B4>\" \",VLOOKUP(B4,'Lookup and lists'!B28:C311,2, FALSE),\" \")","v":"KZN KWAZULU-NATAL"}]
[]
["Web Address","www.mkhambathini.gov.za"]
[]
["e-mail Address","mm@mkhambathini"]
[]
["B. CONTACT INFORMATION"]
["Postal address:"]
["P.O. Box","Private bag X04"]
["City / Town","Camperdown"]
["Postal Code",3720]
[]
["Street address"]
["Building","18 old main road "]
["Street No. & Name","Camperdown"]
["City / Town","Camperdown"]
["Postal Code",3720]
[]
["General Contacts"]
["Telephone number",317859300]
["Fax number","0317852121"]
[]
["C. POLITICAL LEADERSHIP"]
["Speaker:",null,"Secretary/PA to the Speaker:"]
["ID Number","6703035937088","ID Number","7310170539080"]
["Title","Mr","Title","Mrs"]
["Name","Cllr T.A. Gwala","Name","Mrs. Nompumelelo Makhanya"]
["Telephone number","031 785 9318","Telephone number","0317859316"]
["Cell number","0825934610","Cell number","0826594155"]
["Fax number","031 785 2121","Fax number","0317852121"]
["E-mail address","speaker@mkhambathini.gov.za","E-mail address","mpume.makhanya@mkhambathini.gov.za"]
[]
["Mayor/Executive Mayor:",null,"Secretary/PA to the Mayor/Executive Mayor:"]
["ID Number","6011115589088","ID Number","7805080583086"]
["Title","Mr","Title","Mrs"]
["Name","Cllr E Ngcongo","Name","Zandile Mathenjwa"]
["Telephone number","0317859318","Telephone number",317859317]
["Cell number","0723534647","Cell number",844463391]
["Fax number","0317852121","Fax number",317852121]
["E-mail address","mayor@mkhambathini.gov.za","E-mail address","mayor@mkhambathini.gov.za"]
[]
["Deputy Mayor/Executive Mayor:",null,"Secretary/PA to the Deputy Mayor/Executive Mayor:"]
["ID Number","7109040468086","ID Number","7310170539080"]
["Title","Mrs","Title","Mrs"]
["Name","Cllr L.Z Lembethe","Name","Mrs. Nompumelelo Makhanya"]
["Telephone number","031 785 9314","Telephone number","0317859316"]
["Cell number","0834667846","Cell number","0826594155"]
["Fax number","031 785 2121","Fax number","0317852121"]
["E-mail address","deputymayor@mkhambathini.gov.za","E-mail address","mpume.makhanya@mkhambathini.gov.za"]
[]
["D. MANAGEMENT LEADERSHIP"]
["Municipal Manager:",null,"Secretary/PA to the Municipal Manager:"]
["ID Number","8503036087083","ID Number","9611290379085"]
["Title","Municipal Manager","Title","Miss"]
["Name","Mr Sanele Mngwengwe","Name","Nokulunga Nkosi"]
["Telephone number","031 785 9520","Telephone number",317859307]
["Cell number","082 850 9555","Cell number",733824086]
["Fax number","031 785 2121","Fax number",317852121]
["E-mail address","mm@mkhambathini.gov.za","E-mail address","secretarymm@mkhambathini.gov.za"]
[]
["Chief Financial Officer",null,"Secretary/PA to the Chief Financial Officer"]
["ID Number","8204305598088","ID Number","8105240556083"]
["Title","Mr","Title","Mrs"]
["Name","Thokozani Gambu","Name","Ms.Mpho Motsoeneng"]
["Telephone number","0317859300","Telephone number","0317859319"]
["Cell number",823130226,"Cell number",7146094720]
["Fax number","0317852121","Fax number","0317852121"]
["E-mail address","cfo@mkhambathini.gov.za","E-mail address","mpho.motsoeneng@mkhambathini.gov.za"]
[]
["Official responsible for submitting financial information",null,"Official responsible for submitting financial information"]
["ID Number","880228570086","ID Number","9406101281087"]
["Title","Budget Officer ","Title","Miss"]
["Name","Mr Thuthukani Zondo","Name","Nonkululeko Ngubane"]
["Telephone number","031 785 9333","Telephone number","0317859326"]
["Cell number","0716409705","Cell number","0791808234"]
["Fax number","031 785 2121","Fax number","031 785 2121"]
["E-mail address","budget@mkhambathini.gov.za","E-mail address","budget@mkhambathini.gov.za"]
["Official responsible for submitting financial information",null,"Official responsible for submitting financial information"]
["ID Number",null,"ID Number"]
["Title",null,"Title"]
["Name",null,"Name"]
["Telephone number",null,"Telephone number"]
["Cell number",null,"Cell number"]
["Fax number",null,"Fax number"]
["E-mail address",null,"E-mail address"]
["Official responsible for submitting financial information",null,"Official responsible for submitting financial information"]
["ID Number",null,"ID Number"]
["Title",null,"Title"]
["Name",null,"Name"]
["Telephone number",null,"Telephone number"]
["Cell number",null,"Cell number"]
["Fax number",null,"Fax number"]
["E-mail address",null,"E-mail address"]
["Official responsible for submitting financial information",null,"Official responsible for submitting financial information"]
["ID Number",null,"ID Number"]
["Title",null,"Title"]
["Name",null,"Name"]
["Telephone number",null,"Telephone number"]
["Cell number",null,"Cell number"]
["Fax number",null,"Fax number"]
["E-mail address",null,"E-mail address"]
["Official responsible for submitting financial information",null,"Official responsible for submitting financial information"]
["ID Number",null,"ID Number"]
["Title",null,"Title"]
["Name",null,"Name"]
["Telephone number",null,"Telephone number"]
["Cell number",null,"Cell number"]
["Fax number",null,"Fax number"]
["E-mail address",null,"E-mail address"]
["Official responsible for submitting financial information",null,"Official responsible for submitting financial information"]
["ID Number",null,"ID Number"]
["Title",null,"Title"]
["Name",null,"Name"]
["Telephone number",null,"Telephone number"]
["Cell number",null,"Cell number"]
["Fax number",null,"Fax number"]
["E-mail address",null,"E-mail address"]
["Official responsible for submitting financial information",null,"Official responsible for submitting financial information"]
["ID Number",null,"ID Number"]
["Title",null,"Title"]
["Name",null,"Name"]
["Telephone number",null,"Telephone number"]
["Cell number",null,"Cell number"]
["Fax number",null,"Fax number"]
["E-mail address",null,"E-mail address"]
["Official responsible for submitting financial information"]
["ID Number"]
["Title"]
["Name"]
["Telephone number"]
["Cell number"]
["Fax number"]
["E-mail address"]

{"sheet":"C1-Sum","index":6,"n_rows":52,"n_cols":10,"rows_kept":52,"cut":false,"hidden":false,"merged":[[54,0,54,9],[1,0,2,0],[1,2,1,9]]}
[{"$f":"muni& \" - \"&s71sum& \" - \"&date","v":"Choose name from list - Table C1 Monthly Budget Statement Summary - Mid-Year Assessment"}]
[{"$f":"desc","v":"Description"},{"$f":"Head1","v":"2019/20"},{"$f":"Head2","v":"Budget Year 2020/21"}]
[null,{"$f":"Head5","v":"Audited Outcome"},{"$f":"Head6","v":"Original Budget"},{"$f":"Head7","v":"Adjusted Budget"},{"$f":"Head38","v":"Monthly actual"},{"$f":"Head39","v":"YearTD actual"},{"$f":"Head40","v":"YearTD budget"},{"$f":"Head41","v":"YTD variance"},{"$f":"Head41","v":"YTD variance"},{"$f":"Head8","v":"Full Year Forecast"}]
["R thousands",null,null,null,null,null,null,null,"%"]
["Financial Performance"]
["Property rates",{"$f":"SUM('C4-FinPerf RE'!C6:C6)","v":17367687},{"$f":"SUM('C4-FinPerf RE'!D6:D6)","v":19781622},{"$f":"SUM('C4-FinPerf RE'!E6:E6)","v":19781622},{"$f":"SUM('C4-FinPerf RE'!F6:F6)","v":1599529},{"$f":"SUM('C4-FinPerf RE'!G6:G6)","v":9597548},{"$f":"SUM('C4-FinPerf RE'!H6:H6)","v":9890813.0199999996},{"$f":"F6-G6","v":-293265.01999999955},{"$f":"IF(H6=0,\"\",H6/G6)","v":-2.9650244060523103E-2},{"$f":"SUM('C4-FinPerf RE'!K6:K6)","v":19781622}]
["Service charges",{"$f":"SUM('C4-FinPerf RE'!C7:C10)","v":528201},{"$f":"SUM('C4-FinPerf RE'!D7:D10)","v":574287},{"$f":"SUM('C4-FinPerf RE'!E7:E10)","v":574287},{"$f":"SUM('C4-FinPerf RE'!F7:F10)","v":44458},{"$f":"SUM('C4-FinPerf RE'!G7:G10)","v":266748},{"$f":"SUM('C4-FinPerf RE'!H7:H10)","v":287142},{"$f":"F7-G7","v":-20394},{"$f":"IF(H7=0,\"\",H7/G7)","v":-7.1024092609231676E-2},{"$f":"SUM('C4-FinPerf RE'!K7:K10)","v":574287}]
["Investment revenue",{"$f":"'C4-FinPerf RE'!C13","v":4285972},{"$f":"'C4-FinPerf RE'!D13","v":3850000},{"$f":"'C4-FinPerf RE'!E13","v":3850000},{"$f":"'C4-FinPerf RE'!F13","v":127274},{"$f":"'C4-FinPerf RE'!G13","v":892752},{"$f":"'C4-FinPerf RE'!H13","v":1924998},{"$f":"F8-G8","v":-1032246},{"$f":"IF(H8=0,\"\",H8/G8)","v":-0.53623224543609915},{"$f":"'C4-FinPerf RE'!K13","v":3850000}]
["Transfers and subsidies",{"$f":"'C4-FinPerf RE'!C19","v":69092059},{"$f":"'C4-FinPerf RE'!D19","v":73462500},{"$f":"'C4-FinPerf RE'!E19","v":85867500},{"$f":"'C4-FinPerf RE'!F19","v":33239068},{"$f":"'C4-FinPerf RE'!G19","v":65605750},{"$f":"'C4-FinPerf RE'!H19","v":42933750},{"$f":"F9-G9","v":22672000},{"$f":"IF(H9=0,\"\",H9/G9)","v":0.52806940926427348},{"$f":"'C4-FinPerf RE'!K19","v":85867500}]
["Other own revenue",{"$f":"'C4-FinPerf RE'!C12+'C4-FinPerf RE'!C14+'C4-FinPerf RE'!C15+'C4-FinPerf RE'!C16+'C4-FinPerf RE'!C17+'C4-FinPerf RE'!C18+'C4-FinPerf RE'!C20+'C4-FinPerf RE'!C21","v":6471279},{"$f":"'C4-FinPerf RE'!D12+'C4-FinPerf RE'!D14+'C4-FinPerf RE'!D15+'C4-FinPerf RE'!D16+'C4-FinPerf RE'!D17+'C4-FinPerf RE'!D18+'C4-FinPerf RE'!D20+'C4-FinPerf RE'!D21","v":10558046},{"$f":"'C4-FinPerf RE'!E12+'C4-FinPerf RE'!E14+'C4-FinPerf RE'!E15+'C4-FinPerf RE'!E16+'C4-FinPerf RE'!E17+'C4-FinPerf RE'!E18+'C4-FinPerf RE'!E20+'C4-FinPerf RE'!E21","v":10558046},{"$f":"'C4-FinPerf RE'!F12+'C4-FinPerf RE'!F14+'C4-FinPerf RE'!F15+'C4-FinPerf RE'!F16+'C4-FinPerf RE'!F17+'C4-FinPerf RE'!F18+'C4-FinPerf RE'!F20+'C4-FinPerf RE'!F21","v":2688268},{"$f":"'C4-FinPerf RE'!G12+'C4-FinPerf RE'!G14+'C4-FinPerf RE'!G15+'C4-FinPerf RE'!G16+'C4-FinPerf RE'!G17+'C4-FinPerf RE'!G18+'C4-FinPerf RE'!G20+'C4-FinPerf RE'!G21","v":5287402},{"$f":"'C4-FinPerf RE'!H12+'C4-FinPerf RE'!H14+'C4-FinPerf RE'!H15+'C4-FinPerf RE'!H16+'C4-FinPerf RE'!H17+'C4-FinPerf RE'!H18+'C4-FinPerf RE'!H20+'C4-FinPerf RE'!H21","v":5279028},{"$f":"F10-G10","v":8374},{"$f":"IF(H10=0,\"\",H10/G10)","v":1.5862768676354814E-3},{"$f":"'C4-FinPerf RE'!K12+'C4-FinPerf RE'!K14+'C4-FinPerf RE'!K15+'C4-FinPerf RE'!K16+'C4-FinPerf RE'!K17+'C4-FinPerf RE'!K18+'C4-FinPerf RE'!K20+'C4-FinPerf RE'!K21","v":10558046}]
["Total Revenue (excluding capital transfers and contributions)",{"$f":"SUM(B6:B10)","v":97745198},108226455,120631455,37698597,81650200,60315731.019999996,{"$f":"F11-G11","v":21334468.980000004},{"$f":"IF(H11=0,\"\",H11/G11)","v":0.35371317928528034},120631455]
["Employee costs",{"$f":"'C4-FinPerf RE'!C25","v":36529095},{"$f":"'C4-FinPerf RE'!D25","v":44691585},{"$f":"'C4-FinPerf RE'!E25","v":44691585},{"$f":"'C4-FinPerf RE'!F25","v":5121303},{"$f":"'C4-FinPerf RE'!G25","v":20700872},{"$f":"'C4-FinPerf RE'!H25","v":22345806},-1644934,-7.3612650176950428E-2,{"$f":"'C4-FinPerf RE'!K25","v":44691612}]
["Remuneration of Councillors",{"$f":"'C4-FinPerf RE'!C26","v":6023555},{"$f":"'C4-FinPerf RE'!D26","v":6373921},{"$f":"'C4-FinPerf RE'!E26","v":6373921},{"$f":"'C4-FinPerf RE'!F26","v":501793},{"$f":"'C4-FinPerf RE'!G26","v":2973759},{"$f":"'C4-FinPerf RE'!H26","v":3186966},-213207,-6.6899678251980094E-2,{"$f":"'C4-FinPerf RE'!K26","v":6373932}]
["Depreciation & asset impairment",{"$f":"'C4-FinPerf RE'!C28","v":9318525},{"$f":"'C4-FinPerf RE'!D28","v":11173339},{"$f":"'C4-FinPerf RE'!E28","v":11173339},{"$f":"'C4-FinPerf RE'!F28","v":810718},{"$f":"'C4-FinPerf RE'!G28","v":4806692},{"$f":"'C4-FinPerf RE'!H28","v":5586666},-779974,-0.13961350114719584,{"$f":"'C4-FinPerf RE'!K28","v":11173332}]
["Finance charges",{"$f":"'C4-FinPerf RE'!C29","v":4109},{"$f":"'C4-FinPerf RE'!D29","v":0},{"$f":"'C4-FinPerf RE'!E29","v":0},{"$f":"'C4-FinPerf RE'!F29","v":0},{"$f":"'C4-FinPerf RE'!G29","v":4206},{"$f":"'C4-FinPerf RE'!H29","v":0},4206,{"$error":"#DIV/0!"},{"$f":"'C4-FinPerf RE'!K29","v":0}]
["Materials and bulk purchases",{"$f":"SUM('C4-FinPerf RE'!C30:C31)","v":2898053},{"$f":"SUM('C4-FinPerf RE'!D30:D31)","v":6366500},{"$f":"SUM('C4-FinPerf RE'!E30:E31)","v":6366500},{"$f":"SUM('C4-FinPerf RE'!F30:F31)","v":321575},{"$f":"SUM('C4-FinPerf RE'!G30:G31)","v":2389087},{"$f":"SUM('C4-FinPerf RE'!H30:H31)","v":3183264},-794177,-0.24948511967590498,{"$f":"SUM('C4-FinPerf RE'!K30:K31)","v":6366528}]
["Transfers and subsidies",{"$f":"'C4-FinPerf RE'!C33","v":0},{"$f":"'C4-FinPerf RE'!D33","v":309425},{"$f":"'C4-FinPerf RE'!E33","v":309425},{"$f":"'C4-FinPerf RE'!F33","v":0},{"$f":"'C4-FinPerf RE'!G33","v":66285},{"$f":"'C4-FinPerf RE'!H33","v":154710},-88425,-0.57155322862129143,{"$f":"'C4-FinPerf RE'!K33","v":309420}]
["Other expenditure",{"$f":"'C4-FinPerf RE'!C36-SUM('C1-Sum'!B12:B17)","v":42093387},{"$f":"'C4-FinPerf RE'!D36-SUM('C1-Sum'!C12:C17)","v":52622132},{"$f":"'C4-FinPerf RE'!E36-SUM('C1-Sum'!D12:D17)","v":52622132},{"$f":"'C4-FinPerf RE'!F36-SUM('C1-Sum'!E12:E17)","v":4223198},{"$f":"'C4-FinPerf RE'!G36-SUM('C1-Sum'!F12:F17)","v":27478945},{"$f":"'C4-FinPerf RE'!H36-SUM('C1-Sum'!G12:G17)","v":26311152},1167793,4.4383955518177233E-2,{"$f":"'C4-FinPerf RE'!K36-SUM('C1-Sum'!J12:J17)","v":52622304}]
["Total Expenditure",{"$f":"SUM(B12:B18)","v":96866724},121536902,121536902,10978587,58419846,60768564,-2348718,-3.8650213949436095E-2,{"$f":"SUM(J12:J18)","v":121537128}]
["Surplus/(Deficit)",{"$f":"B11-B19","v":878474},-13310447,-905447,26720010,23230354,-452832.98000000417,23683186.980000004,-52.300048861281674,{"$f":"J11-J19","v":-905673}]
[{"$f":"'C4-FinPerf RE'!A39","v":"Transfers and subsidies - capital (monetary allocations) (National / Provincial and District)"},{"$f":"'C4-FinPerf RE'!C39","v":16076001},{"$f":"'C4-FinPerf RE'!D39","v":15996000},{"$f":"'C4-FinPerf RE'!E39","v":15996000},{"$f":"'C4-FinPerf RE'!F39","v":333103},{"$f":"'C4-FinPerf RE'!G39","v":11106881},{"$f":"'C4-FinPerf RE'!H39","v":7998000},3108881,0.38870730182545637,{"$f":"'C4-FinPerf RE'!K39","v":15996000}]
[{"$f":"'C4-FinPerf RE'!A40&\" & \"&'C4-FinPerf RE'!A41","v":"Transfers and subsidies - capital (monetary allocations) (National / Provincial Departmental Agencies, Households, Non-profit Institutions, Private Enterprises, Public Corporatons, Higher Educational Institutions) & Transfers and subsidies - capital (in-kind - all) "},{"$f":"SUM('C4-FinPerf RE'!C40:C41)","v":0},{"$f":"SUM('C4-FinPerf RE'!D40:D41)","v":0},{"$f":"SUM('C4-FinPerf RE'!E40:E41)","v":0},{"$f":"SUM('C4-FinPerf RE'!F40:F41)","v":0},{"$f":"SUM('C4-FinPerf RE'!G40:G41)","v":10036},{"$f":"SUM('C4-FinPerf RE'!H40:H41)","v":0},10036,{"$error":"#DIV/0!"},{"$f":"SUM('C4-FinPerf RE'!K40:K41)","v":0}]
["Surplus/(Deficit) after capital transfers & contributions",{"$f":"B20+B21+B22","v":16954475},2685553,15090553,27053113,34347271,7545167.0199999958,26802103.980000004,3.5522214298180002,{"$f":"J20+J21+J22","v":15090327}]
["Share of surplus/ (deficit) of associate",{"$f":"'C4-FinPerf RE'!C47","v":0},{"$f":"'C4-FinPerf RE'!D47","v":0},{"$f":"'C4-FinPerf RE'!E47","v":0},{"$f":"'C4-FinPerf RE'!F47","v":0},{"$f":"'C4-FinPerf RE'!G47","v":0},{"$f":"'C4-FinPerf RE'!H47","v":0},0,"",{"$f":"'C4-FinPerf RE'!K47","v":0}]
["Surplus/ (Deficit) for the year",{"$f":"B23+B24","v":16954475},2685553,15090553,27053113,34347271,7545167.0199999958,26802103.980000004,3.5522214298180002,{"$f":"J23+J24","v":15090327}]
[]
["Capital expenditure & funds sources"]
["Capital expenditure",{"$f":"'C5-Capex'!C40","v":210788293},{"$f":"'C5-Capex'!D40","v":25696767},{"$f":"'C5-Capex'!E40","v":33420752},{"$f":"'C5-Capex'!F40","v":4030949},{"$f":"'C5-Capex'!G40","v":22129248},{"$f":"'C5-Capex'!H40","v":15970506},{"$f":"F28-G28","v":6158742},{"$f":"IF(H28=0,\"\",H28/G28)","v":0.38563223983009681},{"$f":"'C5-Capex'!K40","v":31941000.659999996}]
["Capital transfers recognised",{"$f":"'C5-Capex'!C70","v":124282443},{"$f":"'C5-Capex'!D70","v":15996767},{"$f":"'C5-Capex'!E70","v":15996002},{"$f":"'C5-Capex'!F70","v":289655},{"$f":"'C5-Capex'!G70","v":9240502},{"$f":"'C5-Capex'!H70","v":7998000},1242502,0.15535158789697423,{"$f":"'C5-Capex'!K70","v":15996000}]
[]
["Borrowing",{"$f":"'C5-Capex'!C72","v":0},{"$f":"'C5-Capex'!D72","v":0},{"$f":"'C5-Capex'!E72","v":0},{"$f":"'C5-Capex'!F72","v":0},{"$f":"'C5-Capex'!G72","v":0},{"$f":"'C5-Capex'!H72","v":0},0,"",{"$f":"'C5-Capex'!K72","v":0}]
["Internally generated funds",{"$f":"'C5-Capex'!C73","v":92392856},{"$f":"'C5-Capex'!D73","v":9700000},{"$f":"'C5-Capex'!E73","v":17424750},{"$f":"'C5-Capex'!F73","v":3741294},{"$f":"'C5-Capex'!G73","v":12888746},{"$f":"'C5-Capex'!H73","v":7972506},4916240,0.61664926937652975,{"$f":"'C5-Capex'!K73","v":15945012}]
["Total sources of capital funds",{"$f":"+B29+B31+B32","v":216675299},25696767,33420752,4030949,22129248,15970506,6158742,0.38563223983009681,{"$f":"+J29+J31+J32","v":31941012}]
[]
["Financial position"]
["Total current assets",{"$f":"'C6-FinPos'!C13","v":87884617},{"$f":"'C6-FinPos'!D13","v":106812901},{"$f":"'C6-FinPos'!E13","v":106812901},null,{"$f":"'C6-FinPos'!F13","v":122933907.52},null,null,null,{"$f":"'C6-FinPos'!G13","v":106812901}]
["Total non current assets",{"$f":"'C6-FinPos'!C25","v":141518792},{"$f":"'C6-FinPos'!D25","v":176890888},{"$f":"'C6-FinPos'!E25","v":176890888},null,{"$f":"'C6-FinPos'!F25","v":168740460.99999997},null,null,null,{"$f":"'C6-FinPos'!G25","v":170645121}]
["Total current liabilities",{"$f":"'C6-FinPos'!C35","v":13052595},{"$f":"'C6-FinPos'!D35","v":12960907},{"$f":"'C6-FinPos'!E35","v":12960907},null,{"$f":"'C6-FinPos'!F35","v":18544423.500000004},null,null,null,{"$f":"'C6-FinPos'!G35","v":7960907}]
["Total non current liabilities",{"$f":"'C6-FinPos'!C40","v":2590571},{"$f":"'C6-FinPos'!D40","v":5110195},{"$f":"'C6-FinPos'!E40","v":5110195},null,{"$f":"'C6-FinPos'!F40","v":2374000},null,null,null,{"$f":"'C6-FinPos'!G40","v":5110195}]
["Community wealth/Equity",{"$f":"'C6-FinPos'!C48","v":213760243},{"$f":"'C6-FinPos'!D48","v":265632687},{"$f":"'C6-FinPos'!E48","v":265632687},null,{"$f":"'C6-FinPos'!F48","v":270755945.01999998},null,null,null,{"$f":"'C6-FinPos'!G48","v":264386920}]
[]
["Cash flows"]
["Net cash from (used) operating",{"$f":"'C7-CFlow'!C18","v":51630017},{"$f":"'C7-CFlow'!D18","v":17535308},{"$f":"'C7-CFlow'!E18","v":17535308},{"$f":"'C7-CFlow'!F18","v":30638562.590000004},{"$f":"'C7-CFlow'!G18","v":42302201.920000002},{"$f":"'C7-CFlow'!H18","v":46653079.5},{"$f":"G43-F43","v":4350877.5799999982},{"$f":"IF(H43=0,\"\",H43/G43)","v":9.3260244053128327E-2},{"$f":"'C7-CFlow'!K18","v":17749854.689999953}]
["Net cash from (used) investing",{"$f":"'C7-CFlow'!C28","v":189451960},{"$f":"'C7-CFlow'!D28","v":-31941767},{"$f":"'C7-CFlow'!E28","v":-31941767},{"$f":"'C7-CFlow'!F28","v":-4030949},{"$f":"'C7-CFlow'!G28","v":-22129249},{"$f":"'C7-CFlow'!H28","v":-15970883},{"$f":"G44-F44","v":6158366},{"$f":"IF(H44=0,\"\",H44/G44)","v":-0.38559959396108529},{"$f":"'C7-CFlow'!K28","v":31941002}]
["Net cash from (used) financing",{"$f":"'C7-CFlow'!C37","v":0},{"$f":"'C7-CFlow'!D37","v":0},{"$f":"'C7-CFlow'!E37","v":0},{"$f":"'C7-CFlow'!F37","v":0},{"$f":"'C7-CFlow'!G37","v":0},{"$f":"'C7-CFlow'!H37","v":0},{"$f":"G45-F45","v":0},{"$f":"IF(H45=0,\"\",H45/G45)","v":""},{"$f":"'C7-CFlow'!K37","v":0}]
["Cash/cash equivalents at the month/year end",{"$f":"'C7-CFlow'!C41","v":306536676},{"$f":"'C7-CFlow'!D41","v":95634541},{"$f":"'C7-CFlow'!E41","v":95634541},{"$f":"'C7-CFlow'!F41","v":0},{"$f":"'C7-CFlow'!G41","v":85627651.920000002},{"$f":"'C7-CFlow'!H41","v":140723196.5},{"$f":"G46-F46","v":55095544.579999998},{"$f":"IF(H46=0,\"\",H46/G46)","v":0.39151714820520012},{"$f":"'C7-CFlow'!K41","v":115145555.68999995}]
[]
["Debtors & creditors analysis",{"$f":"'SC3'!C3","v":"0-30 Days"},{"$f":"'SC3'!D3","v":"31-60 Days"},{"$f":"'SC3'!E3","v":"61-90 Days"},{"$f":"'SC3'!F3","v":"91-120 Days"},{"$f":"'SC3'!G3","v":"121-150 Dys"},{"$f":"'SC3'!H3","v":"151-180 Dys"},{"$f":"'SC3'!I3","v":"181 Dys-1 Yr"},{"$f":"'SC3'!J3","v":"Over 1Yr"},"Total"]
[{"$f":"LEFT('SC3'!A4,20)","v":"Debtors Age Analysis"}]
[{"$f":"'SC3'!A14","v":"Total By Income Source"},{"$f":"'SC3'!C14","v":1263779},{"$f":"'SC3'!D14","v":681062},{"$f":"'SC3'!E14","v":-760966},{"$f":"'SC3'!F14","v":633521},{"$f":"'SC3'!G14","v":468361},{"$f":"'SC3'!H14","v":449384},{"$f":"'SC3'!I14","v":2527397},{"$f":"'SC3'!J14","v":23872824},{"$f":"'SC3'!K14","v":29135362}]
[{"$f":"LEFT('SC4'!A5,22)","v":"Creditors Age Analysis"}]
["Total Creditors",{"$f":"'SC4'!C15","v":1175646},{"$f":"'SC4'!D15","v":0},{"$f":"'SC4'!E15","v":0},{"$f":"'SC4'!F15","v":0},{"$f":"'SC4'!G15","v":0},{"$f":"'SC4'!H15","v":0},{"$f":"'SC4'!I15","v":0},{"$f":"'SC4'!J15","v":0},{"$f":"'SC4'!K15","v":1175646}]

{"sheet":"C2-FinPerf SC","index":7,"n_rows":55,"n_cols":11,"rows_kept":55,"cut":false,"hidden":false,"merged":[[1,1,2,1],[1,0,2,0],[0,0,0,10],[54,0,54,10]]}
[{"$f":"muni& \" - \"&S71A& \" - \"&date","v":"Choose name from list - Table C2 Monthly Budget Statement - Financial Performance (functional classification) - Mid-Year Assessment"}]
[{"$f":"desc","v":"Description"},{"$f":"head27","v":"Ref"},{"$f":"Head1","v":"2019/20"},{"$f":"Head2","v":"Budget Year 2020/21"}]
[null,null,{"$f":"Head5","v":"Audited Outcome"},{"$f":"Head6","v":"Original Budget"},{"$f":"Head7","v":"Adjusted Budget"},{"$f":"Head38","v":"Monthly actual"},{"$f":"Head39","v":"YearTD actual"},{"$f":"Head40","v":"YearTD budget"},{"$f":"Head41","v":"YTD variance"},{"$f":"Head41","v":"YTD variance"},{"$f":"Head8","v":"Full Year Forecast"}]
["R thousands",1,null,null,null,null,null,null,null,"%"]
["Revenue - Functional"]
["Governance and administration",null,{"$f":"SUM(C7:C9)","v":106050185},113346009,125751009,34985519,86197620,62875499.019999996,{"$f":"G6-H6","v":23322120.980000004},{"$f":"IF(I6=0,\"\",I6/H6)","v":0.37092542156335806},{"$f":"SUM(K7:K9)","v":125751009}]
["Executive and council",null,{"$f":"'C2C'!C7","v":0},{"$f":"'C2C'!D7","v":0},{"$f":"'C2C'!E7","v":0},{"$f":"'C2C'!F7","v":0},{"$f":"'C2C'!G7","v":0},{"$f":"'C2C'!H7","v":0},0,{"$f":"IF(I7=0,\"\",I7/H7)","v":""},{"$f":"'C2C'!K7","v":0}]
["Finance and administration",null,{"$f":"'C2C'!C10","v":106050185},{"$f":"'C2C'!D10","v":113346009},{"$f":"'C2C'!E10","v":125751009},{"$f":"'C2C'!F10","v":34985519},{"$f":"'C2C'!G10","v":86197620},{"$f":"'C2C'!H10","v":62875499.019999996},23322120.980000004,0.37092542156335806,{"$f":"'C2C'!K10","v":125751009}]
["Internal audit",null,{"$f":"'C2C'!C24","v":0},{"$f":"'C2C'!D24","v":0},{"$f":"'C2C'!E24","v":0},{"$f":"'C2C'!F24","v":0},{"$f":"'C2C'!G24","v":0},{"$f":"'C2C'!H24","v":0},0,"",{"$f":"'C2C'!K24","v":0}]
["Community and public safety",null,{"$f":"SUM(C11:C15)","v":2502293},2212094,2212094,341137,1118561,1106052,12509,1.1309594847258537E-2,{"$f":"SUM(K11:K15)","v":2212094}]
["Community and social services",null,{"$f":"'C2C'!C27","v":2477352},{"$f":"'C2C'!D27","v":2212094},{"$f":"'C2C'!E27","v":2212094},{"$f":"'C2C'!F27","v":341137},{"$f":"'C2C'!G27","v":1118561},{"$f":"'C2C'!H27","v":1106052},12509,1.1309594847258537E-2,{"$f":"'C2C'!K27","v":2212094}]
["Sport and recreation",null,{"$f":"'C2C'!C49","v":24941},{"$f":"'C2C'!D49","v":0},{"$f":"'C2C'!E49","v":0},{"$f":"'C2C'!F49","v":0},{"$f":"'C2C'!G49","v":0},{"$f":"'C2C'!H49","v":0},0,"",{"$f":"'C2C'!K49","v":0}]
["Public safety",null,{"$f":"'C2C'!C55","v":0},{"$f":"'C2C'!D55","v":0},{"$f":"'C2C'!E55","v":0},{"$f":"'C2C'!F55","v":0},{"$f":"'C2C'!G55","v":0},{"$f":"'C2C'!H55","v":0},0,"",{"$f":"'C2C'!K55","v":0}]
["Housing",null,{"$f":"'C2C'!C64","v":0},{"$f":"'C2C'!D64","v":0},{"$f":"'C2C'!E64","v":0},{"$f":"'C2C'!F64","v":0},{"$f":"'C2C'!G64","v":0},{"$f":"'C2C'!H64","v":0},{"$f":"G14-H14","v":0},{"$f":"IF(I14=0,\"\",I14/H14)","v":""},{"$f":"'C2C'!K64","v":0}]
["Health",null,{"$f":"'C2C'!C67","v":0},{"$f":"'C2C'!D67","v":0},{"$f":"'C2C'!E67","v":0},{"$f":"'C2C'!F67","v":0},{"$f":"'C2C'!G67","v":0},{"$f":"'C2C'!H67","v":0},0,"",{"$f":"'C2C'!K67","v":0}]
["Economic and environmental services",null,{"$f":"SUM(C17:C19)","v":155935},968955,968955,2254590,2370825,484476,1886349,3.8935860599905876,{"$f":"SUM(K17:K19)","v":968955}]
["Planning and development",null,{"$f":"'C2C'!C76","v":132745},{"$f":"'C2C'!D76","v":938955},{"$f":"'C2C'!E76","v":938955},{"$f":"'C2C'!F76","v":2254590},{"$f":"'C2C'!G76","v":2370825},{"$f":"'C2C'!H76","v":469476},1901349,4.0499386550111192,{"$f":"'C2C'!K76","v":938955}]
["Road transport",null,{"$f":"'C2C'!C87","v":23190},{"$f":"'C2C'!D87","v":30000},{"$f":"'C2C'!E87","v":30000},{"$f":"'C2C'!F87","v":0},{"$f":"'C2C'!G87","v":0},{"$f":"'C2C'!H87","v":15000},-15000,-1,{"$f":"'C2C'!K87","v":30000}]
["Environmental protection",null,{"$f":"'C2C'!C92","v":0},{"$f":"'C2C'!D92","v":0},{"$f":"'C2C'!E92","v":0},{"$f":"'C2C'!F92","v":0},{"$f":"'C2C'!G92","v":0},{"$f":"'C2C'!H92","v":0},0,"",{"$f":"'C2C'!K92","v":0}]
["Trading services",null,{"$f":"SUM(C21:C24)","v":528201},{"$f":"SUM(D21:D24)","v":574287},574287,44458,266748,287142,-20394,-7.1024092609231676E-2,{"$f":"SUM(K21:K24)","v":574287}]
["Energy sources",null,{"$f":"'C2C'!C100","v":0},{"$f":"'C2C'!D100","v":0},{"$f":"'C2C'!E100","v":0},{"$f":"'C2C'!F100","v":0},{"$f":"'C2C'!G100","v":0},{"$f":"'C2C'!H100","v":0},{"$f":"G21-H21","v":0},"",{"$f":"'C2C'!K100","v":0}]
["Water management",null,{"$f":"'C2C'!C104","v":0},{"$f":"'C2C'!D104","v":0},{"$f":"'C2C'!E104","v":0},{"$f":"'C2C'!F104","v":0},{"$f":"'C2C'!G104","v":0},{"$f":"'C2C'!H104","v":0},{"$f":"G22-H22","v":0},"",{"$f":"'C2C'!K104","v":0}]
["Waste water management",null,{"$f":"'C2C'!C108","v":0},{"$f":"'C2C'!D108","v":0},{"$f":"'C2C'!E108","v":0},{"$f":"'C2C'!F108","v":0},{"$f":"'C2C'!G108","v":0},{"$f":"'C2C'!H108","v":0},{"$f":"G23-H23","v":0},"",{"$f":"'C2C'!K108","v":0}]
["Waste management",null,{"$f":"'C2C'!C113","v":528201},{"$f":"'C2C'!D113","v":574287},{"$f":"'C2C'!E113","v":574287},{"$f":"'C2C'!F113","v":44458},{"$f":"'C2C'!G113","v":266748},{"$f":"'C2C'!H113","v":287142},{"$f":"G24-H24","v":-20394},-7.1024092609231676E-2,{"$f":"'C2C'!K113","v":574287}]
["Other",4,{"$f":"'C2C'!C118","v":4704487},{"$f":"'C2C'!D118","v":7121110},{"$f":"'C2C'!E118","v":7121110},{"$f":"'C2C'!F118","v":405996},{"$f":"'C2C'!G118","v":2813363},{"$f":"'C2C'!H118","v":3560562},{"$f":"G25-H25","v":-747199},-0.2098542308770357,{"$f":"'C2C'!K118","v":7121110}]
["Total Revenue - Functional",2,{"$f":"C6+C10+C16+C20+C25","v":113941101},{"$f":"D6+D10+D16+D20+D25","v":124222455},136627455,38031700,92767117,68313731.019999996,24453385.980000004,0.35795711367076211,{"$f":"K6+K10+K16+K20+K25","v":136627455}]
[]
["Expenditure - Functional"]
["Governance and administration",null,{"$f":"SUM(C30:C32)","v":53963638},69553541,69553541,4509638,25823513,34776816,{"$f":"G29-H29","v":-8953303},{"$f":"IF(I29=0,\"\",I29/H29)","v":-0.25745033702912884},{"$f":"SUM(K30:K32)","v":69553538.849999994}]
["Executive and council",null,{"$f":"'C2C'!C129","v":12619987},{"$f":"'C2C'!D129","v":19001756},{"$f":"'C2C'!E129","v":19001756},{"$f":"'C2C'!F129","v":1315393},{"$f":"'C2C'!G129","v":8160601},{"$f":"'C2C'!H129","v":9500880},-1340279,{"$f":"IF(I30=0,\"\",I30/H30)","v":-0.14106893256203637},{"$f":"'C2C'!K129","v":19001755.550000001}]
["Finance and administration",null,{"$f":"'C2C'!C132","v":41343651},{"$f":"'C2C'!D132","v":50551785},{"$f":"'C2C'!E132","v":50551785},{"$f":"'C2C'!F132","v":3194245},{"$f":"'C2C'!G132","v":17662912},{"$f":"'C2C'!H132","v":25275936},-7613024,-0.30119652146610909,{"$f":"'C2C'!K132","v":50551783.299999997}]
["Internal audit",null,{"$f":"'C2C'!C146","v":0},{"$f":"'C2C'!D146","v":0},{"$f":"'C2C'!E146","v":0},{"$f":"'C2C'!F146","v":0},{"$f":"'C2C'!G146","v":0},{"$f":"'C2C'!H146","v":0},0,"",{"$f":"'C2C'!K146","v":0}]
["Community and public safety",null,{"$f":"SUM(C34:C38)","v":18243367},24955232,24955232,3493506,11172570,12477672,-1305102,-0.10459499175807795,{"$f":"SUM(K34:K38)","v":24955231.289999999}]
["Community and social services",null,{"$f":"'C2C'!C149","v":14039866},{"$f":"'C2C'!D149","v":21370232},{"$f":"'C2C'!E149","v":21370232},{"$f":"'C2C'!F149","v":2967737},{"$f":"'C2C'!G149","v":10058658},{"$f":"'C2C'!H149","v":10685154},-626496,-5.8632379093459953E-2,{"$f":"'C2C'!K149","v":21370231.289999999}]
["Sport and recreation",null,{"$f":"'C2C'!C171","v":4086381},{"$f":"'C2C'!D171","v":3300000},{"$f":"'C2C'!E171","v":3300000},{"$f":"'C2C'!F171","v":430184},{"$f":"'C2C'!G171","v":1003747},{"$f":"'C2C'!H171","v":1650018},-646271,-0.39167512111989083,{"$f":"'C2C'!K171","v":3300000}]
["Public safety",null,{"$f":"'C2C'!C177","v":1704},{"$f":"'C2C'!D177","v":15000},{"$f":"'C2C'!E177","v":15000},{"$f":"'C2C'!F177","v":0},{"$f":"'C2C'!G177","v":0},{"$f":"'C2C'!H177","v":7500},-7500,-1,{"$f":"'C2C'!K177","v":15000}]
["Housing",null,{"$f":"'C2C'!C186","v":0},{"$f":"'C2C'!D186","v":0},{"$f":"'C2C'!E186","v":0},{"$f":"'C2C'!F186","v":0},{"$f":"'C2C'!G186","v":0},{"$f":"'C2C'!H186","v":0},0,"",{"$f":"'C2C'!K186","v":0}]
["Health",null,{"$f":"'C2C'!C189","v":115416},{"$f":"'C2C'!D189","v":270000},{"$f":"'C2C'!E189","v":270000},{"$f":"'C2C'!F189","v":95585},{"$f":"'C2C'!G189","v":110165},{"$f":"'C2C'!H189","v":135000},-24835,-0.18396296296296297,{"$f":"'C2C'!K189","v":270000}]
["Economic and environmental services",null,{"$f":"SUM(C40:C42)","v":11984020},17956674,17956674,790216,16917777,8978340,7939437,0.88428785276565602,{"$f":"SUM(K40:K42)","v":17956673.849999998}]
["Planning and development",null,{"$f":"'C2C'!C198","v":1694782},{"$f":"'C2C'!D198","v":580000},{"$f":"'C2C'!E198","v":580000},{"$f":"'C2C'!F198","v":15000},{"$f":"'C2C'!G198","v":49777},{"$f":"'C2C'!H198","v":290004},-240227,-0.82835753989600147,{"$f":"'C2C'!K198","v":580000}]
["Road transport",null,{"$f":"'C2C'!C209","v":10289238},{"$f":"'C2C'!D209","v":17376674},{"$f":"'C2C'!E209","v":17376674},{"$f":"'C2C'!F209","v":775216},{"$f":"'C2C'!G209","v":16868000},{"$f":"'C2C'!H209","v":8688336},8179664,0.94145346128418606,{"$f":"'C2C'!K209","v":17376673.849999998}]
["Environmental protection",null,{"$f":"'C2C'!C214","v":0},{"$f":"'C2C'!D214","v":0},{"$f":"'C2C'!E214","v":0},{"$f":"'C2C'!F214","v":0},{"$f":"'C2C'!G214","v":0},{"$f":"'C2C'!H214","v":0},0,"",{"$f":"'C2C'!K214","v":0}]
["Trading services",null,{"$f":"SUM(C44:C47)","v":8849192},{"$f":"SUM(D44:D47)","v":2558000},2558000,2028807,3839625,1279008,2560617,2.0020336072956542,{"$f":"SUM(K44:K47)","v":2558000}]
["Energy sources",null,{"$f":"'C2C'!C222","v":6223503},{"$f":"'C2C'!D222","v":0},{"$f":"'C2C'!E222","v":0},{"$f":"'C2C'!F222","v":1819983},{"$f":"'C2C'!G222","v":2980791},{"$f":"'C2C'!H222","v":0},2980791,{"$error":"#DIV/0!"},{"$f":"'C2C'!K222","v":0}]
["Water management",null,{"$f":"'C2C'!C226","v":0},{"$f":"'C2C'!D226","v":0},{"$f":"'C2C'!E226","v":0},{"$f":"'C2C'!F226","v":0},{"$f":"'C2C'!G226","v":0},{"$f":"'C2C'!H226","v":0},0,"",{"$f":"'C2C'!K226","v":0}]
["Waste water management",null,{"$f":"'C2C'!C230","v":129},{"$f":"'C2C'!D230","v":0},{"$f":"'C2C'!E230","v":0},{"$f":"'C2C'!F230","v":0},{"$f":"'C2C'!G230","v":0},{"$f":"'C2C'!H230","v":0},0,"",{"$f":"'C2C'!K230","v":0}]
["Waste management",null,{"$f":"'C2C'!C235","v":2625560},{"$f":"'C2C'!D235","v":2558000},{"$f":"'C2C'!E235","v":2558000},{"$f":"'C2C'!F235","v":208824},{"$f":"'C2C'!G235","v":858834},{"$f":"'C2C'!H235","v":1279008},-420174,-0.32851553704120695,{"$f":"'C2C'!K235","v":2558000}]
["Other",null,{"$f":"'C2C'!C240","v":3826636},{"$f":"'C2C'!D240","v":6513455},{"$f":"'C2C'!E240","v":6513455},{"$f":"'C2C'!F240","v":156420},{"$f":"'C2C'!G240","v":666361},{"$f":"'C2C'!H240","v":3256728},-2590367,-0.79538942152982994,{"$f":"'C2C'!K240","v":6513455}]
["Total Expenditure - Functional",3,{"$f":"C29+C33+C39+C43+C48","v":96866853},{"$f":"D29+D33+D39+D43+D48","v":121536902},121536902,10978587,58419846,60768564,-2348718,-3.8650213949436095E-2,{"$f":"K29+K33+K39+K43+K48","v":121536898.98999998}]
["Surplus/ (Deficit) for the year",null,{"$f":"C26-C49","v":17074248},2685553,15090553,27053113,34347271,7545167.0199999958,{"$f":"I26-I49","v":26802103.980000004},{"$f":"IF(I50=0,\"\",I50/H50)","v":3.5522214298180002},{"$f":"K26-K49","v":15090556.01000002}]
[{"$f":"head27a","v":"References"}]
["1. Government Finance Statistics Functions and Sub-functions are standardised to assist the compilation of national and international accounts for comparison purposes"]
["2. Total Revenue by functional classification must reconcile to Total Operating Revenue shown in the Financial Performance Statement"]
["3. Total Expenditure by functional classification must reconcile to total operating expenditure shown in 'Financial Performance Statement'"]
["4. All amounts must be classified under a functional classification (modified GFS). The GFS function 'Other' is only for Abbatoirs, Air Transport, Licensing and Regulation, Markets and Tourism - and if used must be supported by footnotes. Nothing else may be placed under 'Other'. Assign associate share to relevant classification"]

{"sheet":"C2C","index":8,"n_rows":257,"n_cols":11,"rows_kept":257,"cut":false,"hidden":false,"merged":[[252,0,252,10],[0,0,0,10],[1,0,2,0],[1,1,2,1]]}
[{"$f":"muni& \" - \"&S71A& \" - \"&date","v":"Choose name from list - Table C2 Monthly Budget Statement - Financial Performance (functional classification) - Mid-Year Assessment"}]
[{"$f":"desc","v":"Description"},{"$f":"head27","v":"Ref"},{"$f":"Head1","v":"2019/20"},{"$f":"Head2","v":"Budget Year 2020/21"}]
[null,null,{"$f":"Head5","v":"Audited Outcome"},{"$f":"Head6","v":"Original Budget"},{"$f":"Head7","v":"Adjusted Budget"},{"$f":"Head38","v":"Monthly actual"},{"$f":"Head39","v":"YearTD actual"},{"$f":"Head40","v":"YearTD budget"},{"$f":"Head41","v":"YTD variance"},{"$f":"Head41","v":"YTD variance"},{"$f":"Head8","v":"Full Year Forecast"}]
["R thousands",1,null,null,null,null,null,null,null,"%"]
["Revenue - Functional"]
["Municipal governance and administration",null,{"$f":"C7+C10+C24","v":106050185},113346009,125751009,34985519,86197620,62875499.019999996,{"$f":"G6-H6","v":23322120.980000004},{"$f":"IF(I6=0,\"\",I6/H6)","v":0.37092542156335806},{"$f":"K7+K10+K24","v":125751009}]
["Executive and council",null,{"$f":"SUM(C8:C9)","v":0},{"$f":"SUM(D8:D9)","v":0},0,0,0,0,{"$f":"G7-H7","v":0},{"$f":"IF(I7=0,\"\",I7/H7)","v":""},0]
["Mayor and Council",null,null,null,null,null,null,null,0,""]
["Municipal Manager, Town Secretary and Chief Executive",null,null,null,null,null,null,null,0,""]
["Finance and administration",null,{"$f":"SUM(C11:C23)","v":106050185},113346009,125751009,34985519,86197620,62875499.019999996,{"$f":"G10-H10","v":23322120.980000004},{"$f":"IF(I10=0,\"\",I10/H10)","v":0.37092542156335806},{"$f":"SUM(K11:K23)","v":125751009}]
["Administrative and Corporate Support",null,40121,62000,62000,0,0,31002,-31002,-1,62000]
["Asset Management",null,120020,0,0,0,10036,0,10036,{"$error":"#DIV/0!"},0]
["Finance",null,43156354,45954009,45954009,2381519,23285584,22976999.02,308584.98000000045,1.3430169002113683E-2,45954009]
["Fleet Management",null,0,0,0,0,0,0,0,"",0]
["Human Resources",null,0,0,0,0,0,0,0,"",0]
["Information Technology",null,0,0,0,0,0,0,{"$f":"G16-H16","v":0},{"$f":"IF(I16=0,\"\",I16/H16)","v":""},0]
["Legal Services",null,0,0,0,0,0,0,0,"",0]
["Marketing, Customer Relations, Publicity and Media Co-ordination",null,0,0,0,0,0,0,0,"",0]
["Property Services",null,62733690,67330000,79735000,32604000,62902000,39867498,23034502,0.57777646342391487,79735000]
["Risk Management",null,0,0,0,0,0,0,0,"",0]
["Security Services",null,0,0,0,0,0,0,0,"",0]
["Supply Chain Management ",null,0,0,0,0,0,0,0,"",0]
["Valuation Service",null,0,0,0,0,0,0,0,"",0]
["Internal audit",null,{"$f":"SUM(C25:C25)","v":0},0,0,0,0,0,0,"",{"$f":"SUM(K25:K25)","v":0}]
["Governance Function",null,null,null,null,null,null,null,0,""]
["Community and public safety",null,{"$f":"C27+C49+C55+C64+C67","v":2502293},{"$f":"D27+D49+D55+D64+D67","v":2212094},2212094,341137,1118561,1106052,12509,1.1309594847258537E-2,2212094]
["Community and social services",null,{"$f":"SUM(C28:C48)","v":2477352},2212094,2212094,341137,1118561,1106052,12509,1.1309594847258537E-2,{"$f":"SUM(K28:K48)","v":2212094}]
["Aged Care",null,0,0,0,0,0,0,{"$f":"G28-H28","v":0},{"$f":"IF(I28=0,\"\",I28/H28)","v":""},0]
["Agricultural",null,0,0,0,0,0,0,0,"",0]
["Animal Care and Diseases",null,0,0,0,0,0,0,0,"",0]
["Cemeteries, Funeral Parlours and Crematoriums",null,0,0,0,0,0,0,0,"",0]
["Child Care Facilities",null,0,0,0,0,0,0,0,"",0]
["Community Halls and Facilities",null,0,0,0,0,0,0,0,"",0]
["Consumer Protection",null,0,0,0,0,0,0,0,"",0]
["Cultural Matters",null,0,0,0,0,0,0,{"$f":"G35-H35","v":0},{"$f":"IF(I35=0,\"\",I35/H35)","v":""},0]
["Disaster Management",null,745000,372500,372500,0,0,186252,-186252,-1,372500]
["Education",null,0,0,0,0,0,0,0,"",0]
["Indigenous and Customary Law",null,0,0,0,0,0,0,0,"",0]
["Industrial Promotion",null,0,0,0,0,0,0,0,"",0]
["Language Policy",null,0,0,0,0,0,0,0,"",0]
["Libraries and Archives",null,1732352,1839594,1839594,341137,1118561,919800,198761,0.21609154163948685,1839594]
["Literacy Programmes",null,0,0,0,0,0,0,0,"",0]
["Media Services",null,0,0,0,0,0,0,0,"",0]
["Museums and Art Galleries",null,0,0,0,0,0,0,0,"",0]
["Population Development",null,0,0,0,0,0,0,0,"",0]
["Provincial Cultural Matters",null,0,0,0,0,0,0,0,"",0]
["Theatres",null,0,0,0,0,0,0,0,"",0]
["Zoo's",null,0,0,0,0,0,0,0,"",0]
["Sport and recreation",null,{"$f":"SUM(C50:C54)","v":24941},{"$f":"SUM(D50:D54)","v":0},0,0,0,0,{"$f":"G49-H49","v":0},{"$f":"IF(I49=0,\"\",I49/H49)","v":""},0]
["Beaches and Jetties ",null,0,0,0,0,0,0,0,""]
["Casinos, Racing, Gambling, Wagering",null,0,0,0,0,0,0,0,""]
["Community Parks (including Nurseries)",null,0,0,0,0,0,0,0,""]
["Recreational Facilities",null,0,0,0,0,0,0,0,""]
["Sports Grounds and Stadiums",null,24941,0,0,0,0,0,0,""]
["Public safety",null,{"$f":"SUM(C56:C63)","v":0},{"$f":"SUM(D56:D63)","v":0},0,0,0,0,0,"",0]
["Civil Defence",null,null,null,null,null,null,null,0,""]
["Cleansing",null,null,null,null,null,null,null,0,""]
["Control of Public Nuisances",null,null,null,null,null,null,null,{"$f":"G58-H58","v":0},{"$f":"IF(I58=0,\"\",I58/H58)","v":""}]
["Fencing and Fences ",null,null,null,null,null,null,null,0,""]
["Fire Fighting and Protection",null,null,null,null,null,null,null,0,""]
["Licensing and Control of Animals",null,null,null,null,null,null,null,{"$f":"G61-H61","v":0},{"$f":"IF(I61=0,\"\",I61/H61)","v":""}]
["Police Forces, Traffic and Street Parking Control",null,null,null,null,null,null,null,{"$f":"G62-H62","v":0},{"$f":"IF(I62=0,\"\",I62/H62)","v":""}]
["Pounds",null,null,null,null,null,null,null,0,""]
["Housing",null,{"$f":"SUM(C65:C66)","v":0},0,0,0,0,0,{"$f":"G64-H64","v":0},{"$f":"IF(I64=0,\"\",I64/H64)","v":""},{"$f":"SUM(K65:K66)","v":0}]
["Housing",null,null,null,null,null,null,null,{"$f":"G65-H65","v":0},{"$f":"IF(I65=0,\"\",I65/H65)","v":""}]
["Informal Settlements",null,null,null,null,null,null,null,{"$f":"G66-H66","v":0},{"$f":"IF(I66=0,\"\",I66/H66)","v":""}]
["Health",null,{"$f":"SUM(C68:C74)","v":0},0,0,0,0,0,0,"",{"$f":"SUM(K68:K74)","v":0}]
["Ambulance",null,null,null,null,null,null,null,0,""]
["Health Services",null,null,null,null,null,null,null,0,""]
["Laboratory Services",null,null,null,null,null,null,null,{"$f":"G70-H70","v":0},{"$f":"IF(I70=0,\"\",I70/H70)","v":""}]
["Food Control",null,null,null,null,null,null,null,{"$f":"G71-H71","v":0},{"$f":"IF(I71=0,\"\",I71/H71)","v":""}]
["Health Surveillance and Prevention of Communicable Diseases including immunizations",null,null,null,null,null,null,null,0,""]
["Vector Control",null,null,null,null,null,null,null,0,""]
["Chemical Safety",null,null,null,null,null,null,null,0,""]
["Economic and environmental services",null,{"$f":"C76+C87+C92","v":155935},968955,968955,2254590,2370825,484476,1886349,3.8935860599905876,{"$f":"K76+K87+K92","v":968955}]
["Planning and development",null,{"$f":"SUM(C77:C86)","v":132745},938955,938955,2254590,2370825,469476,1901349,4.0499386550111192,{"$f":"SUM(K77:K86)","v":938955}]
["Billboards",null,0,0,0,0,0,0,{"$f":"G77-H77","v":0},{"$f":"IF(I77=0,\"\",I77/H77)","v":""},0]
["Corporate Wide Strategic Planning (IDPs, LEDs)",null,0,0,0,0,0,0,0,"",0]
["Central City Improvement District",null,0,0,0,0,0,0,0,"",0]
["Development Facilitation",null,0,0,0,0,0,0,{"$f":"G80-H80","v":0},{"$f":"IF(I80=0,\"\",I80/H80)","v":""},0]
["Economic Development/Planning",null,0,0,0,0,0,0,{"$f":"G81-H81","v":0},{"$f":"IF(I81=0,\"\",I81/H81)","v":""},0]
["Regional Planning and Development",null,0,0,0,0,0,0,{"$f":"G82-H82","v":0},{"$f":"IF(I82=0,\"\",I82/H82)","v":""},0]
["Town Planning, Building Regulations and Enforcement, and City Engineer",null,132745,938955,938955,2254590,2370825,469476,{"$f":"G83-H83","v":1901349},{"$f":"IF(I83=0,\"\",I83/H83)","v":4.0499386550111192},938955]
["Project Management Unit",null,0,0,0,0,0,0,0,"",0]
["Provincial Planning",null,0,0,0,0,0,0,0,"",0]
["Support to Local Municipalities",null,0,0,0,0,0,0,0,"",0]
["Road transport",null,{"$f":"SUM(C88:C91)","v":23190},30000,30000,0,0,15000,-15000,-1,{"$f":"SUM(K88:K91)","v":30000}]
["Public Transport",null,0,0,0,0,0,0,0,"",0]
["Road and Traffic Regulation",null,0,0,0,0,0,0,0,"",0]
["Roads",null,23190,30000,30000,0,0,15000,-15000,-1,30000]
["Taxi Ranks",null,0,0,0,0,0,0,0,"",0]
["Environmental protection",null,{"$f":"SUM(C93:C98)","v":0},{"$f":"SUM(D93:D98)","v":0},0,0,0,0,0,"",0]
["Biodiversity and Landscape",null,null,null,null,null,null,null,0,""]
["Coastal Protection",null,null,null,null,null,null,null,0,""]
["Indigenous Forests",null,null,null,null,null,null,null,{"$f":"G95-H95","v":0},{"$f":"IF(I95=0,\"\",I95/H95)","v":""}]
["Nature Conservation",null,null,null,null,null,null,null,{"$f":"G96-H96","v":0},{"$f":"IF(I96=0,\"\",I96/H96)","v":""}]
["Pollution Control",null,null,null,null,null,null,null,0,""]
["Soil Conservation",null,null,null,null,null,null,null,0,""]
["Trading services",null,{"$f":"C100+C104+C108+C113","v":528201},{"$f":"D100+D104+D108+D113","v":574287},574287,44458,266748,287142,-20394,-7.1024092609231676E-2,{"$f":"K100+K104+K108+K113","v":574287}]
["Energy sources",null,{"$f":"SUM(C101:C103)","v":0},{"$f":"SUM(D101:D103)","v":0},0,0,0,0,0,"",0]
["Electricity ",null,null,null,null,null,null,null,0,""]
["Street Lighting and Signal Systems",null,null,null,null,null,null,null,{"$f":"G102-H102","v":0},{"$f":"IF(I102=0,\"\",I102/H102)","v":""}]
["Nonelectric Energy",null,null,null,null,null,null,null,0,""]
["Water management",null,{"$f":"SUM(C105:C107)","v":0},{"$f":"SUM(D105:D107)","v":0},0,0,0,0,0,"",0]
["Water Treatment",null,null,null,null,null,null,null,0,""]
["Water Distribution",null,null,null,null,null,null,null,{"$f":"G106-H106","v":0},{"$f":"IF(I106=0,\"\",I106/H106)","v":""}]
["Water Storage",null,null,null,null,null,null,null,0,""]
["Waste water management",null,{"$f":"SUM(C109:C112)","v":0},{"$f":"SUM(D109:D112)","v":0},0,0,0,0,0,"",0]
["Public Toilets",null,null,null,null,null,null,null,0,""]
["Sewerage",null,null,null,null,null,null,null,0,""]
["Storm Water Management",null,null,null,null,null,null,null,{"$f":"G111-H111","v":0},{"$f":"IF(I111=0,\"\",I111/H111)","v":""}]
["Waste Water Treatment",null,null,null,null,null,null,null,0,""]
["Waste management",null,{"$f":"SUM(C114:C117)","v":528201},574287,574287,44458,266748,287142,-20394,-7.1024092609231676E-2,{"$f":"SUM(K114:K117)","v":574287}]
["Recycling",null,0,0,0,0,0,0,{"$f":"G114-H114","v":0},{"$f":"IF(I114=0,\"\",I114/H114)","v":""},0]
["Solid Waste Disposal (Landfill Sites)",null,0,0,0,0,0,0,{"$f":"G115-H115","v":0},{"$f":"IF(I115=0,\"\",I115/H115)","v":""},0]
["Solid Waste Removal",null,528201,574287,574287,44458,266748,287142,-20394,-7.1024092609231676E-2,574287]
["Street Cleaning",null,0,0,0,0,0,0,{"$f":"G117-H117","v":0},{"$f":"IF(I117=0,\"\",I117/H117)","v":""},0]
["Other",null,{"$f":"SUM(C119:C124)","v":4704487},{"$f":"SUM(D119:D124)","v":7121110},7121110,405996,2813363,3560562,-747199,-0.2098542308770357,7121110]
["Abattoirs",null,0,0,0,0,0,0,0,"",0]
["Air Transport",null,0,0,0,0,0,0,0,"",0]
["Forestry ",null,0,0,0,0,0,0,{"$f":"G121-H121","v":0},{"$f":"IF(I121=0,\"\",I121/H121)","v":""},0]
["Licensing and Regulation",null,4704487,7121110,7121110,405996,2813363,3560562,-747199,-0.2098542308770357,7121110]
["Markets",null,0,0,0,0,0,0,0,"",0]
["Tourism",null,0,0,0,0,0,0,{"$f":"G124-H124","v":0},{"$f":"IF(I124=0,\"\",I124/H124)","v":""},0]
[{"$f":"\"Total \"&A5","v":"Total Revenue - Functional"},2,{"$f":"C6+C26+C75+C99+C118","v":113941101},124222455,136627455,38031700,92767117,68313731.019999996,{"$f":"G125-H125","v":24453385.980000004},{"$f":"IF(I125=0,\"\",I125/H125)","v":0.35795711367076211},{"$f":"K6+K26+K75+K99+K118","v":136627455}]
[]
["Expenditure - Functional"]
[{"$f":"A6","v":"Municipal governance and administration"},null,{"$f":"C129+C132+C146","v":53963638},69553541,69553541,4509638,25823513,34776816,{"$f":"G128-H128","v":-8953303},{"$f":"IF(I128=0,\"\",I128/H128)","v":-0.25745033702912884},{"$f":"K129+K132+K146","v":69553538.849999994}]
["Executive and council",null,{"$f":"SUM(C130:C131)","v":12619987},19001756,19001756,1315393,8160601,9500880,-1340279,-0.14106893256203637,19001755.550000001]
["Mayor and Council",null,8980145,7456921,7456921,711840,4200061,3728472,471589,0.12648318131395381,7456920.7299999995]
["Municipal Manager, Town Secretary and Chief Executive",null,3639842,11544835,11544835,603553,3960540,5772408,-1811868,-0.31388425766162059,11544834.820000002]
["Finance and administration",null,{"$f":"SUM(C133:C145)","v":41343651},50551785,50551785,3194245,17662912,25275936,-7613024,-0.30119652146610909,{"$f":"SUM(K133:K145)","v":50551783.299999997}]
["Administrative and Corporate Support",null,10731235,11894526,11894526,1028771,4590761,5947272,-1356511,-0.22808961823168672,11894525.260000002]
["Asset Management",null,10383094,13173339,13173339,810718,5299183,6586668,-1287485,-0.19546833087685611,13173339]
["Finance",null,12126785,17834080,17834080,964306,3805583,8917056,-5111473,-0.57322427940342646,17834079.229999997]
["Fleet Management",null,1206406,910000,910000,79916,728316,455004,273312,0.6006804335786059,910000]
["Human Resources",null,734652,1099190,1099190,6568,118336,549600,-431264,-0.78468704512372633,1099189.81]
["Information Technology",null,3460653,1595000,1595000,45338,1437768,797502,640266,0.80283936592008542,1595000]
["Legal Services",null,333462,500000,500000,393,393052,250002,143050,0.57219542243662047,500000]
["Marketing, Customer Relations, Publicity and Media Co-ordination",null,0,0,0,0,0,0,0,"",0]
["Property Services",null,2250153,2635650,2635650,73857,1104170,1317828,-213658,-0.16212889694254484,2635650]
["Risk Management",null,0,0,0,0,0,0,0,"",0]
["Security Services",null,0,0,0,0,0,0,0,"",0]
["Supply Chain Management ",null,70542,650000,650000,105975,106482,325002,-218520,-0.67236509313788839,650000]
["Valuation Service",null,46669,260000,260000,78403,79261,130002,-50741,-0.39030937985569453,260000]
["Internal audit",null,{"$f":"SUM(C147:C147)","v":0},0,0,0,0,0,0,"",{"$f":"SUM(K147:K147)","v":0}]
["Governance Function",null,null,null,null,null,null,null,0,""]
["Community and public safety",null,{"$f":"C149+C171+C177+C186+C189","v":18243367},24955232,24955232,3493506,11172570,12477672,-1305102,-0.10459499175807795,{"$f":"K149+K171+K177+K186+K189","v":24955231.289999999}]
["Community and social services",null,{"$f":"SUM(C150:C170)","v":14039866},21370232,21370232,2967737,10058658,10685154,-626496,-5.8632379093459953E-2,{"$f":"SUM(K150:K170)","v":21370231.289999999}]
["Aged Care",null,237085,490000,490000,301572,301572,244998,56574,0.23091617074425097,490000]
["Agricultural",null,179642,150000,150000,0,0,75000,-75000,-1,150000]
["Animal Care and Diseases",null,0,0,0,0,0,0,0,"",0]
["Cemeteries, Funeral Parlours and Crematoriums",null,0,0,0,0,0,0,0,"",0]
["Child Care Facilities",null,1008348,0,0,-25000,0,0,0,"",0]
["Community Halls and Facilities",null,7577621,9702528,9702528,1636030,6748381,4851264,1897117,0.39105622782021343,9702527.2899999991]
["Consumer Protection",null,0,0,0,0,0,0,0,"",0]
["Cultural Matters",null,209824,620000,620000,303412,606938,310008,{"$f":"G157-H157","v":296930},{"$f":"IF(I157=0,\"\",I157/H157)","v":0.95781399189698335},620000]
["Disaster Management",null,347962,1430000,1430000,239413,384318,715002,{"$f":"G158-H158","v":-330684},{"$f":"IF(I158=0,\"\",I158/H158)","v":-0.46249381120612248},1430000]
["Education",null,405345,190000,190000,0,91500,95004,{"$f":"G159-H159","v":-3504},{"$f":"IF(I159=0,\"\",I159/H159)","v":-3.6882657572312745E-2},190000]
[{"$f":"A38","v":"Indigenous and Customary Law"},null,98912,261500,261500,0,0,130752,-130752,-1,261500]
["Industrial Promotion",null,0,380000,380000,0,0,190002,-190002,-1,380000]
["Language Policy",null,0,0,0,0,0,0,0,"",0]
["Libraries and Archives",null,2080138,2919704,2919704,339878,1114263,1459860,-345597,-0.23673297439480498,2919704]
["Literacy Programmes",null,859950,2320000,2320000,0,0,1159998,-1159998,-1,2320000]
["Media Services",null,0,0,0,0,0,0,0,"",0]
["Museums and Art Galleries",null,0,0,0,0,0,0,0,"",0]
["Population Development",null,1035039,2906500,2906500,172432,811686,1453266,-641580,-0.44147458207926149,2906500]
["Provincial Cultural Matters",null,0,0,0,0,0,0,0,"",0]
["Theatres",null,0,0,0,0,0,0,0,"",0]
["Zoo's",null,0,0,0,0,0,0,0,"",0]
["Sport and recreation",null,{"$f":"SUM(C172:C176)","v":4086381},3300000,3300000,430184,1003747,1650018,{"$f":"G171-H171","v":-646271},{"$f":"IF(I171=0,\"\",I171/H171)","v":-0.39167512111989083},3300000]
["Beaches and Jetties ",null,0,0,0,0,0,0,0,"",0]
["Casinos, Racing, Gambling, Wagering",null,0,0,0,0,0,0,0,"",0]
["Community Parks (including Nurseries)",null,0,0,0,0,0,0,0,"",0]
["Recreational Facilities",null,0,0,0,0,0,0,0,"",0]
["Sports Grounds and Stadiums",null,4086381,3300000,3300000,430184,1003747,1650018,-646271,-0.39167512111989083,3300000]
["Public safety",null,{"$f":"SUM(C178:C185)","v":1704},15000,15000,0,0,7500,-7500,-1,15000]
["Civil Defence",null,0,0,0,0,0,0,0,"",0]
["Cleansing",null,0,0,0,0,0,0,0,"",0]
["Control of Public Nuisances",null,0,0,0,0,0,0,{"$f":"G180-H180","v":0},{"$f":"IF(I180=0,\"\",I180/H180)","v":""},0]
["Fencing and Fences ",null,0,0,0,0,0,0,0,"",0]
["Fire Fighting and Protection",null,1704,15000,15000,0,0,7500,-7500,-1,15000]
["Licensing and Control of Animals",null,0,0,0,0,0,0,{"$f":"G183-H183","v":0},{"$f":"IF(I183=0,\"\",I183/H183)","v":""},0]
["Police Forces, Traffic and Street Parking Control",null,0,0,0,0,0,0,{"$f":"G184-H184","v":0},{"$f":"IF(I184=0,\"\",I184/H184)","v":""},0]
["Pounds",null,0,0,0,0,0,0,0,"",0]
["Housing",null,{"$f":"SUM(C187:C188)","v":0},0,0,0,0,0,{"$f":"G186-H186","v":0},{"$f":"IF(I186=0,\"\",I186/H186)","v":""},{"$f":"SUM(K187:K188)","v":0}]
["Housing",null,null,null,null,null,null,null,{"$f":"G187-H187","v":0},{"$f":"IF(I187=0,\"\",I187/H187)","v":""}]
["Informal Settlements",null,null,null,null,null,null,null,{"$f":"G188-H188","v":0},{"$f":"IF(I188=0,\"\",I188/H188)","v":""}]
["Health",null,{"$f":"SUM(C190:C196)","v":115416},270000,270000,95585,110165,135000,-24835,-0.18396296296296297,270000]
["Ambulance",null,0,0,0,0,0,0,0,"",0]
["Health Services",null,115416,270000,270000,95585,110165,135000,-24835,-0.18396296296296297,270000]
[{"$f":"A70","v":"Laboratory Services"},null,0,0,0,0,0,0,0,"",0]
["Food Control",null,0,0,0,0,0,0,{"$f":"G193-H193","v":0},{"$f":"IF(I193=0,\"\",I193/H193)","v":""},0]
["Health Surveillance and Prevention of Communicable Diseases including immunizations",null,0,0,0,0,0,0,{"$f":"G194-H194","v":0},{"$f":"IF(I194=0,\"\",I194/H194)","v":""},0]
["Vector Control",null,0,0,0,0,0,0,0,"",0]
["Chemical Safety",null,0,0,0,0,0,0,0,"",0]
["Economic and environmental services",null,{"$f":"C198+C209+C214","v":11984020},17956674,17956674,790216,{"$f":"G198+G209+G214","v":16917777},8978340,7939437,0.88428785276565602,{"$f":"K198+K209+K214","v":17956673.849999998}]
["Planning and development",null,{"$f":"SUM(C199:C208)","v":1694782},580000,580000,15000,49777,290004,-240227,-0.82835753989600147,580000]
["Billboards",null,0,0,0,0,0,0,0,"",0]
["Corporate Wide Strategic Planning (IDPs, LEDs)",null,0,0,0,0,0,0,0,"",0]
["Central City Improvement District",null,0,0,0,0,0,0,0,"",0]
["Development Facilitation",null,0,0,0,0,0,0,{"$f":"G202-H202","v":0},{"$f":"IF(I202=0,\"\",I202/H202)","v":""},0]
["Economic Development/Planning",null,1445271,140000,140000,0,9780,70002,{"$f":"G203-H203","v":-60222},{"$f":"IF(I203=0,\"\",I203/H203)","v":-0.86028970600839971},140000]
["Regional Planning and Development",null,0,0,0,0,0,0,{"$f":"G204-H204","v":0},{"$f":"IF(I204=0,\"\",I204/H204)","v":""},0]
["Town Planning, Building Regulations and Enforcement, and City Engineer",null,249511,440000,440000,15000,39997,220002,{"$f":"G205-H205","v":-180005},{"$f":"IF(I205=0,\"\",I205/H205)","v":-0.81819710729902451},440000]
["Project Management Unit",null,0,0,0,0,0,0,{"$f":"G206-H206","v":0},{"$f":"IF(I206=0,\"\",I206/H206)","v":""},0]
["Provincial Planning",null,0,0,0,0,0,0,0,"",0]
["Support to Local Municipalities",null,0,0,0,0,0,0,0,"",0]
["Road transport",null,{"$f":"SUM(C210:C213)","v":10289238},17376674,17376674,775216,16868000,8688336,8179664,0.94145346128418606,{"$f":"SUM(K210:K213)","v":17376673.849999998}]
["Public Transport",null,0,0,0,0,0,0,0,"",0]
["Road and Traffic Regulation",null,0,0,0,0,0,0,{"$f":"G211-H211","v":0},{"$f":"IF(I211=0,\"\",I211/H211)","v":""},0]
["Roads",null,10289238,17376674,17376674,775216,16868000,8688336,8179664,0.94145346128418606,17376673.849999998]
["Taxi Ranks",null,0,0,0,0,0,0,0,"",0]
["Environmental protection",null,{"$f":"SUM(C215:C220)","v":0},0,0,0,0,0,0,"",0]
["Biodiversity and Landscape",null,0,0,0,0,0,0,0,""]
["Coastal Protection",null,0,0,0,0,0,0,0,""]
["Indigenous Forests",null,0,0,0,0,0,0,0,""]
["Nature Conservation",null,0,0,0,0,0,0,{"$f":"G218-H218","v":0},{"$f":"IF(I218=0,\"\",I218/H218)","v":""}]
["Pollution Control",null,0,0,0,0,0,0,{"$f":"G219-H219","v":0},{"$f":"IF(I219=0,\"\",I219/H219)","v":""}]
["Soil Conservation",null,0,0,0,0,0,0,0,""]
["Trading services",null,{"$f":"C222+C226+C230+C235","v":8849192},{"$f":"D222+D226+D230+D235","v":2558000},2558000,2028807,3839625,1279008,2560617,2.0020336072956542,{"$f":"K222+K226+K230+K235","v":2558000}]
["Energy sources",null,{"$f":"SUM(C223:C225)","v":6223503},0,0,1819983,2980791,0,2980791,{"$error":"#DIV/0!"},0]
["Electricity ",null,6223503,0,0,1819983,2980791,0,2980791,{"$error":"#DIV/0!"}]
[{"$f":"A102","v":"Street Lighting and Signal Systems"},null,0,0,0,0,0,0,{"$f":"G224-H224","v":0},{"$f":"IF(I224=0,\"\",I224/H224)","v":""}]
["Nonelectric Energy",null,0,0,0,0,0,0,0,""]
["Water management",null,{"$f":"SUM(C227:C229)","v":0},0,0,0,0,0,0,"",0]
["Water Treatment",null,null,null,null,null,null,null,0,""]
["Water Distribution",null,null,null,null,null,null,null,{"$f":"G228-H228","v":0},{"$f":"IF(I228=0,\"\",I228/H228)","v":""}]
["Water Storage",null,null,null,null,null,null,null,0,""]
["Waste water management",null,{"$f":"SUM(C231:C234)","v":129},0,0,0,0,0,0,"",0]
["Public Toilets",null,0,0,0,0,0,0,0,""]
["Sewerage",null,0,0,0,0,0,0,0,""]
["Storm Water Management",null,129,0,0,0,0,0,{"$f":"G233-H233","v":0},{"$f":"IF(I233=0,\"\",I233/H233)","v":""}]
["Waste Water Treatment",null,0,0,0,0,0,0,0,""]
["Waste management",null,{"$f":"SUM(C236:C239)","v":2625560},2558000,2558000,208824,858834,1279008,-420174,-0.32851553704120695,{"$f":"SUM(K236:K239)","v":2558000}]
["Recycling",null,0,0,0,0,0,0,{"$f":"G236-H236","v":0},{"$f":"IF(I236=0,\"\",I236/H236)","v":""},0]
["Solid Waste Disposal (Landfill Sites)",null,60478,380000,380000,0,2100,190002,{"$f":"G237-H237","v":-187902},{"$f":"IF(I237=0,\"\",I237/H237)","v":-0.98894748476331829},380000]
["Solid Waste Removal",null,2565082,2138000,2138000,208824,825169,1069008,{"$f":"G238-H238","v":-243839},{"$f":"IF(I238=0,\"\",I238/H238)","v":-0.22809838654154133},2138000]
["Street Cleaning",null,0,40000,40000,0,31565,19998,11567,0.57840784078407836,40000]
["Other",null,{"$f":"SUM(C241:C246)","v":3826636},6513455,6513455,156420,666361,3256728,-2590367,-0.79538942152982994,6513455]
["Abattoirs",null,0,0,0,0,0,0,0,"",0]
["Air Transport",null,0,0,0,0,0,0,0,"",0]
["Forestry ",null,0,0,0,0,0,0,{"$f":"G243-H243","v":0},{"$f":"IF(I243=0,\"\",I243/H243)","v":""},0]
["Licensing and Regulation",null,3826636,6513455,6513455,156420,333112,3256728,-2923616,-0.8977157441456578,6513455]
["Markets",null,0,0,0,0,0,0,{"$f":"G245-H245","v":0},{"$f":"IF(I245=0,\"\",I245/H245)","v":""},0]
["Tourism",null,0,0,0,0,333249,0,{"$f":"G246-H246","v":333249},{"$f":"IF(I246=0,\"\",I246/H246)","v":{"$error":"#DIV/0!"}},0]
[{"$f":"\"Total \"&A127","v":"Total Expenditure - Functional"},3,{"$f":"C128+C148+C197+C221+C240","v":96866853},121536902,121536902,10978587,58419846,60768564,-2348718,{"$f":"IF(I247=0,\"\",I247/H247)","v":-3.8650213949436095E-2},{"$f":"K128+K148+K197+K221+K240","v":121536898.98999998}]
[{"$f":"result","v":"Surplus/ (Deficit) for the year"},null,{"$f":"C125-C247","v":17074248},2685553,15090553,27053113,34347271,7545167.0199999958,{"$f":"G248-H248","v":26802103.980000004},{"$f":"IF(I248=0,\"\",I248/H248)","v":3.5522214298180002},{"$f":"K125-K247","v":15090556.01000002}]
[{"$f":"head27a","v":"References"}]
["1. Government Finance Statistics Functions and Sub-functions are standardised to assist national and international accounts and comparison"]
["2. Total Revenue by Functional Classification must reconcile to total operating revenue shown in Financial Performance (revenue and expenditure)"]
["3. Total Expenditure by Functional Classification must reconcile to total operating expenditure shown in Financial Performance (revenue and expenditure)"]
["4. All amounts must be classified under a Functional classification. The function 'Other' is only for Abbatoirs, Air Transport, Licensing and Regulation, Markets and Tourism - and if used must be supported by footnotes. Nothing else may be placed under 'Other'. Assign associate share to relevant classification"]
[]
[]
["check oprev balance",null,{"$f":"C125-'C4-FinPerf RE'!C53","v":119902},{"$f":"D125-'C4-FinPerf RE'!D53","v":0},{"$f":"E125-'C4-FinPerf RE'!E53","v":0},{"$f":"F125-'C4-FinPerf RE'!F53","v":0},{"$f":"G125-'C4-FinPerf RE'!G53","v":0},{"$f":"H125-'C4-FinPerf RE'!H53","v":0},{"$f":"I125-'C4-FinPerf RE'!I53","v":24453385.980000004},null,{"$f":"K125-'C4-FinPerf RE'!K53","v":0}]
["check opexp balance",null,{"$f":"C247-'C4-FinPerf RE'!C36","v":129},{"$f":"D247-'C4-FinPerf RE'!D36","v":0},{"$f":"E247-'C4-FinPerf RE'!E36","v":0},{"$f":"F247-'C4-FinPerf RE'!F36","v":0},{"$f":"G247-'C4-FinPerf RE'!G36","v":0},{"$f":"H247-'C4-FinPerf RE'!H36","v":0},{"$f":"I247-'C4-FinPerf RE'!I36","v":0},null,{"$f":"K247-'C4-FinPerf RE'!K36","v":-229.01000002026558}]

{"sheet":"C3-FinPerf V","index":9,"n_rows":43,"n_cols":11,"rows_kept":43,"cut":false,"hidden":false,"merged":[[0,0,0,10],[1,1,3,1],[1,3,1,10]]}
[{"$f":"muni& \" - \"&S71C& \" - \"&date","v":"Choose name from list - Table C3 Monthly Budget Statement - Financial Performance (revenue and expenditure by municipal vote) - Mid-Year Assessment"}]
[{"$f":"Vdesc","v":"Vote Description"},{"$f":"head27","v":"Ref"},{"$f":"Head1","v":"2019/20"},{"$f":"Head2","v":"Budget Year 2020/21"}]
[null,null,{"$f":"Head5","v":"Audited Outcome"},{"$f":"Head6","v":"Original Budget"},{"$f":"Head7","v":"Adjusted Budget"},{"$f":"Head38","v":"Monthly actual"},{"$f":"Head39","v":"YearTD actual"},{"$f":"Head40","v":"YearTD budget"},{"$f":"Head41","v":"YTD variance"},{"$f":"Head41","v":"YTD variance"},{"$f":"Head8","v":"Full Year Forecast"}]
["R thousands",null,null,null,null,null,null,null,null,"%"]
["Revenue by Vote",1]
[{"$f":"'Org structure'!A2","v":"Vote 1 - Finance and Administration"},null,{"$f":"'C3C'!C6","v":106050185},{"$f":"'C3C'!D6","v":113346009},{"$f":"'C3C'!E6","v":125751009},{"$f":"'C3C'!F6","v":34985519},{"$f":"'C3C'!G6","v":86197620},{"$f":"'C3C'!H6","v":62875499.019999996},{"$f":"G6-H6","v":23322120.980000004},{"$f":"IF(I6=0,\"\",I6/H6)","v":0.37092542156335806},{"$f":"'C3C'!K6","v":125751009}]
[{"$f":"'Org structure'!A3","v":"Vote 2 - Finance and Administration2"},null,{"$f":"'C3C'!C17","v":0},{"$f":"'C3C'!D17","v":0},{"$f":"'C3C'!E17","v":0},{"$f":"'C3C'!F17","v":0},{"$f":"'C3C'!G17","v":0},{"$f":"'C3C'!H17","v":0},{"$f":"G7-H7","v":0},{"$f":"IF(I7=0,\"\",I7/H7)","v":""},{"$f":"'C3C'!K17","v":0}]
[{"$f":"'Org structure'!A4","v":"Vote 3 - Executive and Council"},null,{"$f":"'C3C'!C28","v":0},{"$f":"'C3C'!D28","v":0},{"$f":"'C3C'!E28","v":0},{"$f":"'C3C'!F28","v":0},{"$f":"'C3C'!G28","v":0},{"$f":"'C3C'!H28","v":0},0,"",{"$f":"'C3C'!K28","v":0}]
[{"$f":"'Org structure'!A5","v":"Vote 4 - Community and Social Services"},null,{"$f":"'C3C'!C39","v":2477352},{"$f":"'C3C'!D39","v":2212094},{"$f":"'C3C'!E39","v":2212094},{"$f":"'C3C'!F39","v":341137},{"$f":"'C3C'!G39","v":1118561},{"$f":"'C3C'!H39","v":1106052},12509,1.1309594847258537E-2,{"$f":"'C3C'!K39","v":2212094}]
[{"$f":"'Org structure'!A6","v":"Vote 5 - Community and Social Services2"},null,{"$f":"'C3C'!C50","v":0},{"$f":"'C3C'!D50","v":0},{"$f":"'C3C'!E50","v":0},{"$f":"'C3C'!F50","v":0},{"$f":"'C3C'!G50","v":0},{"$f":"'C3C'!H50","v":0},0,"",{"$f":"'C3C'!K50","v":0}]
[{"$f":"'Org structure'!A7","v":"Vote 6 - Energy Sources"},null,{"$f":"'C3C'!C61","v":0},{"$f":"'C3C'!D61","v":0},{"$f":"'C3C'!E61","v":0},{"$f":"'C3C'!F61","v":0},{"$f":"'C3C'!G61","v":0},{"$f":"'C3C'!H61","v":0},0,"",{"$f":"'C3C'!K61","v":0}]
[{"$f":"'Org structure'!A8","v":"Vote 7 - Road Transport"},null,{"$f":"'C3C'!C72","v":23190},{"$f":"'C3C'!D72","v":30000},{"$f":"'C3C'!E72","v":30000},{"$f":"'C3C'!F72","v":0},{"$f":"'C3C'!G72","v":0},{"$f":"'C3C'!H72","v":15000},-15000,-1,{"$f":"'C3C'!K72","v":30000}]
[{"$f":"'Org structure'!A9","v":"Vote 8 - Planning and Development"},null,{"$f":"'C3C'!C83","v":132745},{"$f":"'C3C'!D83","v":938955},{"$f":"'C3C'!E83","v":938955},{"$f":"'C3C'!F83","v":2254590},{"$f":"'C3C'!G83","v":2370825},{"$f":"'C3C'!H83","v":469476},1901349,4.0499386550111192,{"$f":"'C3C'!K83","v":938955}]
[{"$f":"'Org structure'!A10","v":"Vote 9 - Sport and Recreation"},null,{"$f":"'C3C'!C94","v":24941},{"$f":"'C3C'!D94","v":0},{"$f":"'C3C'!E94","v":0},{"$f":"'C3C'!F94","v":0},{"$f":"'C3C'!G94","v":0},{"$f":"'C3C'!H94","v":0},0,"",{"$f":"'C3C'!K94","v":0}]
[{"$f":"'Org structure'!A11","v":"Vote 10 - Public Safety"},null,{"$f":"'C3C'!C105","v":0},{"$f":"'C3C'!D105","v":0},{"$f":"'C3C'!E105","v":0},{"$f":"'C3C'!F105","v":0},{"$f":"'C3C'!G105","v":0},{"$f":"'C3C'!H105","v":0},0,"",{"$f":"'C3C'!K105","v":0}]
[{"$f":"'Org structure'!A12","v":"Vote 11 - Other"},null,{"$f":"'C3C'!C116","v":4704487},{"$f":"'C3C'!D116","v":7121110},{"$f":"'C3C'!E116","v":7121110},{"$f":"'C3C'!F116","v":405996},{"$f":"'C3C'!G116","v":2813363},{"$f":"'C3C'!H116","v":3560562},-747199,-0.2098542308770357,{"$f":"'C3C'!K116","v":7121110}]
[{"$f":"'Org structure'!A13","v":"Vote 12 - Waste Management"},null,{"$f":"'C3C'!C127","v":528201},{"$f":"'C3C'!D127","v":574287},{"$f":"'C3C'!E127","v":574287},{"$f":"'C3C'!F127","v":44458},{"$f":"'C3C'!G127","v":266748},{"$f":"'C3C'!H127","v":287142},-20394,-7.1024092609231676E-2,{"$f":"'C3C'!K127","v":574287}]
[{"$f":"'Org structure'!A14","v":"Vote 13 - Housing"},null,{"$f":"'C3C'!C138","v":0},{"$f":"'C3C'!D138","v":0},{"$f":"'C3C'!E138","v":0},{"$f":"'C3C'!F138","v":0},{"$f":"'C3C'!G138","v":0},{"$f":"'C3C'!H138","v":0},0,"",{"$f":"'C3C'!K138","v":0}]
[{"$f":"'Org structure'!A15","v":"Vote 14 - Waste Water Management"},null,{"$f":"'C3C'!C149","v":0},{"$f":"'C3C'!D149","v":0},{"$f":"'C3C'!E149","v":0},{"$f":"'C3C'!F149","v":0},{"$f":"'C3C'!G149","v":0},{"$f":"'C3C'!H149","v":0},0,"",{"$f":"'C3C'!K149","v":0}]
[{"$f":"'Org structure'!A16","v":"Vote 15 - Health"},null,{"$f":"'C3C'!C160","v":0},{"$f":"'C3C'!D160","v":0},{"$f":"'C3C'!E160","v":0},{"$f":"'C3C'!F160","v":0},{"$f":"'C3C'!G160","v":0},{"$f":"'C3C'!H160","v":0},0,"",{"$f":"'C3C'!K160","v":0}]
["Total Revenue by Vote",2,{"$f":"SUM(C6:C20)","v":113941101},{"$f":"SUM(D6:D20)","v":124222455},136627455,38031700,92767117,68313731.019999996,24453385.980000004,0.35795711367076211,{"$f":"SUM(K6:K20)","v":136627455}]
[]
["Expenditure by Vote",1]
[{"$f":"'Org structure'!A2","v":"Vote 1 - Finance and Administration"},null,{"$f":"'C3C'!C174","v":41273109},{"$f":"'C3C'!D174","v":49901785},{"$f":"'C3C'!E174","v":49901785},{"$f":"'C3C'!F174","v":3088270},{"$f":"'C3C'!G174","v":17556430},{"$f":"'C3C'!H174","v":24950934},{"$f":"G24-H24","v":-7394504},{"$f":"IF(I24=0,\"\",I24/H24)","v":-0.29636181154581226},{"$f":"'C3C'!K174","v":49901785}]
[{"$f":"'Org structure'!A3","v":"Vote 2 - Finance and Administration2"},null,{"$f":"'C3C'!C185","v":70542},{"$f":"'C3C'!D185","v":650000},{"$f":"'C3C'!E185","v":650000},{"$f":"'C3C'!F185","v":105975},{"$f":"'C3C'!G185","v":106482},{"$f":"'C3C'!H185","v":325002},-218520,-0.67236509313788839,{"$f":"'C3C'!K185","v":650000}]
[{"$f":"'Org structure'!A4","v":"Vote 3 - Executive and Council"},null,{"$f":"'C3C'!C196","v":12619987},{"$f":"'C3C'!D196","v":19001756},{"$f":"'C3C'!E196","v":19001756},{"$f":"'C3C'!F196","v":1315393},{"$f":"'C3C'!G196","v":8160601},{"$f":"'C3C'!H196","v":9500880},-1340279,-0.14106893256203637,{"$f":"'C3C'!K196","v":19001755.550000001}]
[{"$f":"'Org structure'!A5","v":"Vote 4 - Community and Social Services"},null,{"$f":"'C3C'!C207","v":5196950},{"$f":"'C3C'!D207","v":9157704},{"$f":"'C3C'!E207","v":9157704},{"$f":"'C3C'!F207","v":1331707},{"$f":"'C3C'!G207","v":3218777},{"$f":"'C3C'!H207","v":4578888},-1360111,-0.29703958690406929,{"$f":"'C3C'!K207","v":9157704}]
[{"$f":"'Org structure'!A6","v":"Vote 5 - Community and Social Services2"},null,{"$f":"'C3C'!C218","v":8842916},{"$f":"'C3C'!D218","v":12212528},{"$f":"'C3C'!E218","v":12212528},{"$f":"'C3C'!F218","v":1636030},{"$f":"'C3C'!G218","v":6839881},{"$f":"'C3C'!H218","v":6106266},733615,0.12014134333486291,{"$f":"'C3C'!K218","v":12212527.289999999}]
[{"$f":"'Org structure'!A7","v":"Vote 6 - Energy Sources"},null,{"$f":"'C3C'!C229","v":6223503},{"$f":"'C3C'!D229","v":0},{"$f":"'C3C'!E229","v":0},{"$f":"'C3C'!F229","v":1819983},{"$f":"'C3C'!G229","v":2980791},{"$f":"'C3C'!H229","v":0},2980791,{"$error":"#DIV/0!"},{"$f":"'C3C'!K229","v":0}]
[{"$f":"'Org structure'!A8","v":"Vote 7 - Road Transport"},null,{"$f":"'C3C'!C240","v":10289238},{"$f":"'C3C'!D240","v":17376674},{"$f":"'C3C'!E240","v":17376674},{"$f":"'C3C'!F240","v":775216},{"$f":"'C3C'!G240","v":16868000},{"$f":"'C3C'!H240","v":8688336},8179664,{"$f":"IF(I30=0,\"\",I30/H30)","v":0.94145346128418606},{"$f":"'C3C'!K240","v":17376673.849999998}]
[{"$f":"'Org structure'!A9","v":"Vote 8 - Planning and Development"},null,{"$f":"'C3C'!C251","v":1694782},{"$f":"'C3C'!D251","v":580000},{"$f":"'C3C'!E251","v":580000},{"$f":"'C3C'!F251","v":15000},{"$f":"'C3C'!G251","v":49777},{"$f":"'C3C'!H251","v":290004},-240227,-0.82835753989600147,{"$f":"'C3C'!K251","v":440000}]
[{"$f":"'Org structure'!A10","v":"Vote 9 - Sport and Recreation"},null,{"$f":"'C3C'!C262","v":4086381},{"$f":"'C3C'!D262","v":3300000},{"$f":"'C3C'!E262","v":3300000},{"$f":"'C3C'!F262","v":430184},{"$f":"'C3C'!G262","v":1003747},{"$f":"'C3C'!H262","v":1650018},-646271,-0.39167512111989083,{"$f":"'C3C'!K262","v":3300000}]
[{"$f":"'Org structure'!A11","v":"Vote 10 - Public Safety"},null,{"$f":"'C3C'!C273","v":1704},{"$f":"'C3C'!D273","v":15000},{"$f":"'C3C'!E273","v":15000},{"$f":"'C3C'!F273","v":0},{"$f":"'C3C'!G273","v":0},{"$f":"'C3C'!H273","v":7500},-7500,{"$f":"IF(I33=0,\"\",I33/H33)","v":-1},{"$f":"'C3C'!K273","v":15000}]
[{"$f":"'Org structure'!A12","v":"Vote 11 - Other"},null,{"$f":"'C3C'!C284","v":3826636},{"$f":"'C3C'!D284","v":6513455},{"$f":"'C3C'!E284","v":6513455},{"$f":"'C3C'!F284","v":156420},{"$f":"'C3C'!G284","v":333112},{"$f":"'C3C'!H284","v":3256728},-2923616,{"$f":"IF(I34=0,\"\",I34/H34)","v":-0.8977157441456578},{"$f":"'C3C'!K284","v":6513454.54}]
[{"$f":"'Org structure'!A13","v":"Vote 12 - Waste Management"},null,{"$f":"'C3C'!C295","v":2625560},{"$f":"'C3C'!D295","v":2558000},{"$f":"'C3C'!E295","v":2558000},{"$f":"'C3C'!F295","v":208824},{"$f":"'C3C'!G295","v":858834},{"$f":"'C3C'!H295","v":1279008},-420174,{"$f":"IF(I35=0,\"\",I35/H35)","v":-0.32851553704120695},{"$f":"'C3C'!K295","v":2558000}]
[{"$f":"'Org structure'!A14","v":"Vote 13 - Housing"},null,{"$f":"'C3C'!C306","v":0},{"$f":"'C3C'!D306","v":0},{"$f":"'C3C'!E306","v":0},{"$f":"'C3C'!F306","v":0},{"$f":"'C3C'!G306","v":0},{"$f":"'C3C'!H306","v":0},0,{"$f":"IF(I36=0,\"\",I36/H36)","v":""},{"$f":"'C3C'!K306","v":0}]
[{"$f":"'Org structure'!A15","v":"Vote 14 - Waste Water Management"},null,{"$f":"'C3C'!C317","v":0},{"$f":"'C3C'!D317","v":0},{"$f":"'C3C'!E317","v":0},{"$f":"'C3C'!F317","v":0},{"$f":"'C3C'!G317","v":0},{"$f":"'C3C'!H317","v":0},0,{"$f":"IF(I37=0,\"\",I37/H37)","v":""},{"$f":"'C3C'!K317","v":0}]
[{"$f":"'Org structure'!A16","v":"Vote 15 - Health"},null,{"$f":"'C3C'!C328","v":115416},{"$f":"'C3C'!D328","v":270000},{"$f":"'C3C'!E328","v":270000},{"$f":"'C3C'!F328","v":95585},{"$f":"'C3C'!G328","v":443414},{"$f":"'C3C'!H328","v":135000},308414,2.284548148148148,{"$f":"'C3C'!K328","v":270000}]
["Total Expenditure by Vote",2,{"$f":"SUM(C24:C38)","v":96866724},{"$f":"SUM(D24:D38)","v":121536902},121536902,10978587,58419846,60768564,-2348718,{"$f":"IF(I39=0,\"\",I39/H39)","v":-3.8650213949436095E-2},{"$f":"SUM(K24:K38)","v":121396900.23}]
[{"$f":"result","v":"Surplus/ (Deficit) for the year"},2,{"$f":"C21-C39","v":17074377},2685553,15090553,27053113,34347271,7545167.0199999958,{"$f":"I21-I39","v":26802103.980000004},{"$f":"IF(I40=0,\"\",I40/H40)","v":3.5522214298180002},{"$f":"K21-K39","v":15230554.769999996}]
[{"$f":"head27a","v":"References"}]
["1. Insert 'Vote'; e.g. Department, if different to standard classification structure"]
["2. Must reconcile to Monthly Budget Statement - Financial Performance Statement (standard classification)"]

{"sheet":"C3C","index":10,"n_rows":348,"n_cols":23,"rows_kept":348,"cut":false,"hidden":false,"merged":[[1,11,1,22],[1,3,1,10]]}
[{"$f":"muni& \" - \"&S71C& \" - \"&\"A\"& \" - \"&date","v":"Choose name from list - Table C3 Monthly Budget Statement - Financial Performance (revenue and expenditure by municipal vote) - A - Mid-Year Assessment"}]
[{"$f":"Vdesc","v":"Vote Description"},{"$f":"head27","v":"Ref"},{"$f":"Head1","v":"2019/20"},{"$f":"Head2","v":"Budget Year 2020/21"},null,null,null,null,null,null,null,{"$f":"Head4","v":{"$error":"#REF!"}}]
["R thousand",null,{"$f":"Head5","v":"Audited Outcome"},{"$f":"Head6","v":"Original Budget"},{"$f":"Head7","v":"Adjusted Budget"},{"$f":"Head38","v":"Monthly actual"},{"$f":"Head39","v":"YearTD actual"},{"$f":"Head40","v":"YearTD budget"},{"$f":"Head41","v":"YTD variance"},{"$f":"Head41","v":"YTD variance"},{"$f":"Head8","v":"Full Year Forecast"},{"$f":"Head12","v":"Forecast 2010/11"},{"$f":"Head13","v":"Forecast 2011/12"},{"$f":"Head14","v":"Forecast 2012/13"},{"$f":"Head15","v":"Forecast 2013/14"},{"$f":"Head16","v":"Forecast 2014/15"},{"$f":"Head17","v":"Forecast 2015/16"},{"$f":"Head18","v":"Forecast 2016/17"},{"$f":"Head19","v":"Forecast 2017/18"},{"$f":"Head20","v":"Forecast 2018/19"},{"$f":"Head21","v":"Forecast 2019/20"},{"$f":"Head22","v":"Forecast 2020/21"},{"$f":"Head23","v":"Forecast 2021/22"}]
[null,null,null,null,null,null,null,null,null,"%"]
["Revenue by Vote",1]
["Vote 1 - Finance and Administration",null,{"$f":"SUM(C7:C16)","v":106050185},{"$f":"SUM(D7:D16)","v":113346009},125751009,34985519,86197620,62875499.019999996,{"$f":"G6-H6","v":23322120.980000004},{"$f":"IF(I6=0,\"\",I6/H6)","v":0.37092542156335806},125751009]
["1.1 - Finance",null,43156354,45954009,45954009,2381519,23285584,22976999.02,308584.98000000045,1.3430169002113683E-2,45954009]
[{"$f":"'Org structure'!E4","v":"1.2 - Fleet Management"},null,0,0,0,0,0,0,0,"",0]
[{"$f":"'Org structure'!E5","v":"1.3 - Asset Management"},null,120020,0,0,0,10036,0,10036,{"$error":"#DIV/0!"},0]
[{"$f":"'Org structure'!E6","v":"1.4 - Administrative and Corporate Support"},null,40121,62000,62000,0,0,31002,-31002,-1,62000]
[{"$f":"'Org structure'!E7","v":"1.5 - Human Resources"},null,0,0,0,0,0,0,0,"",0]
[{"$f":"'Org structure'!E8","v":"1.6 - Property Services"},null,62733690,67330000,79735000,32604000,62902000,39867498,23034502,0.57777646342391487,79735000]
[{"$f":"'Org structure'!E9","v":"1.7 - Legal Services"},null,0,0,0,0,0,0,0,"",0]
[{"$f":"'Org structure'!E10","v":"1.8 - Information Technology"},null,0,0,0,0,0,0,0,"",0]
[{"$f":"'Org structure'!E11","v":"1.9 - Marketing, Customer Relations, Publicity and Media Co-ordination"},null,0,0,0,0,0,0,0,"",0]
[{"$f":"'Org structure'!E12","v":"1.10 - Valuation Service"},null,0,0,0,0,0,0,0,"",0]
["Vote 2 - Finance and Administration2",null,{"$f":"SUM(C18:C27)","v":0},{"$f":"SUM(D18:D27)","v":0},0,0,0,0,0,"",0]
[{"$f":"'Org structure'!E14","v":"2.1 - Supply Chain Management"},null,null,null,null,null,null,null,0,""]
[{"$f":"'Org structure'!E15","v":0},null,null,null,null,null,null,null,0,""]
[{"$f":"'Org structure'!E16","v":0},null,null,null,null,null,null,null,0,""]
[{"$f":"'Org structure'!E17","v":0},null,null,null,null,null,null,null,0,""]
[{"$f":"'Org structure'!E18","v":0},null,null,null,null,null,null,null,0,""]
[{"$f":"'Org structure'!E19","v":0},null,null,null,null,null,null,null,0,""]
[{"$f":"'Org structure'!E20","v":0},null,null,null,null,null,null,null,0,""]
[{"$f":"'Org structure'!E21","v":0},null,null,null,null,null,null,null,0,""]
[{"$f":"'Org structure'!E22","v":0},null,null,null,null,null,null,null,0,""]
[{"$f":"'Org structure'!E23","v":0},null,null,null,null,null,null,null,0,""]
["Vote 3 - Executive and Council",null,{"$f":"SUM(C29:C38)","v":0},0,0,0,0,0,0,"",0]
[{"$f":"'Org structure'!E25","v":"3.1 - Municipal Manager, Town Secretary and Chief Executive"},null,null,null,null,null,null,null,0,""]
[{"$f":"'Org structure'!E26","v":"3.2 - Mayor and Council"},null,null,null,null,null,null,null,0,""]
[{"$f":"'Org structure'!E27","v":0},null,null,null,null,null,null,null,0,""]
[{"$f":"'Org structure'!E28","v":0},null,null,null,null,null,null,null,0,""]
[{"$f":"'Org structure'!E29","v":0},null,null,null,null,null,null,null,0,""]
[{"$f":"'Org structure'!E30","v":0},null,null,null,null,null,null,null,0,""]
[{"$f":"'Org structure'!E31","v":0},null,null,null,null,null,null,null,0,""]
[{"$f":"'Org structure'!E32","v":0},null,null,null,null,null,null,null,0,""]
[{"$f":"'Org structure'!E33","v":0},null,null,null,null,null,null,null,0,""]
[{"$f":"'Org structure'!E34","v":0},null,null,null,null,null,null,null,0,""]
["Vote 4 - Community and Social Services",null,{"$f":"SUM(C40:C49)","v":2477352},2212094,2212094,341137,1118561,1106052,12509,1.1309594847258537E-2,2212094]
[{"$f":"'Org structure'!E36","v":"4.1 - Disaster Management"},null,745000,372500,372500,0,0,186252,-186252,-1,372500]
[{"$f":"'Org structure'!E37","v":"4.2 - Libraries and Archives"},null,1732352,1839594,1839594,341137,1118561,919800,198761,0.21609154163948685,1839594]
[{"$f":"'Org structure'!E38","v":"4.3 - Population Development"},null,0,0,0,0,0,0,0,"",0]
[{"$f":"'Org structure'!E39","v":"4.4 - Cultural Matters"},null,0,0,0,0,0,0,0,"",0]
[{"$f":"'Org structure'!E40","v":"4.5 - Indigenous and Customary Law"},null,0,0,0,0,0,0,0,"",0]
[{"$f":"'Org structure'!E41","v":"4.6 - Industrial Promotion"},null,0,0,0,0,0,0,0,"",0]
[{"$f":"'Org structure'!E42","v":"4.7 - Agricultural"},null,0,0,0,0,0,0,0,"",0]
[{"$f":"'Org structure'!E43","v":"4.8 - Aged Care"},null,0,0,0,0,0,0,0,"",0]
[{"$f":"'Org structure'!E44","v":"4.9 - Child Care Facilities"},null,0,0,0,0,0,0,0,"",0]
[{"$f":"'Org structure'!E45","v":"4.10 - Animal Care and Diseases"},null,0,0,0,0,0,0,0,"",0]
["Vote 5 - Community and Social Services2",null,{"$f":"SUM(C51:C60)","v":0},{"$f":"SUM(D51:D60)","v":0},0,0,0,0,0,"",0]
[{"$f":"'Org structure'!E47","v":"5.1 - Literacy Programmes"},null,null,null,null,null,null,null,0,""]
[{"$f":"'Org structure'!E48","v":"5.2 - Education"},null,null,null,null,null,null,null,0,""]
[{"$f":"'Org structure'!E49","v":"5.3 - Community Halls and Facilities"},null,null,null,null,null,null,null,0,""]
[{"$f":"'Org structure'!E50","v":0},null,null,null,null,null,null,null,0,""]
[{"$f":"'Org structure'!E51","v":0},null,null,null,null,null,null,null,0,""]
[{"$f":"'Org structure'!E52","v":0},null,null,null,null,null,null,null,0,""]
[{"$f":"'Org structure'!E53","v":0},null,null,null,null,null,null,null,0,""]
[{"$f":"'Org structure'!E54","v":0},null,null,null,null,null,null,null,0,""]
[{"$f":"'Org structure'!E55","v":0},null,null,null,null,null,null,null,0,""]
[{"$f":"'Org structure'!E56","v":0},null,null,null,null,null,null,null,0,""]
[{"$f":"'Org structure'!A7","v":"Vote 6 - Energy Sources"},null,{"$f":"SUM(C62:C71)","v":0},{"$f":"SUM(D62:D71)","v":0},0,0,0,0,0,"",0]
[{"$f":"'Org structure'!E58","v":"6.1 - Electricity"},null,null,null,null,null,null,null,0,""]
[{"$f":"'Org structure'!E59","v":0},null,null,null,null,null,null,null,0,""]
[{"$f":"'Org structure'!E60","v":0},null,null,null,null,null,null,null,0,""]
[{"$f":"'Org structure'!E61","v":0},null,null,null,null,null,null,null,0,""]
[{"$f":"'Org structure'!E62","v":0},null,null,null,null,null,null,null,0,""]
[{"$f":"'Org structure'!E63","v":0},null,null,null,null,null,null,null,0,""]
[{"$f":"'Org structure'!E64","v":0},null,null,null,null,null,null,null,0,""]
[{"$f":"'Org structure'!E65","v":0},null,null,null,null,null,null,null,0,""]
[{"$f":"'Org structure'!E66","v":0},null,null,null,null,null,null,null,{"$f":"G70-H70","v":0},{"$f":"IF(I70=0,\"\",I70/H70)","v":""}]
[{"$f":"'Org structure'!E67","v":0},null,null,null,null,null,null,null,0,""]
[{"$f":"'Org structure'!A8","v":"Vote 7 - Road Transport"},null,{"$f":"SUM(C73:C82)","v":23190},30000,30000,0,0,15000,-15000,-1,30000]
[{"$f":"'Org structure'!E69","v":"7.1 - Roads"},null,23190,30000,30000,0,0,15000,-15000,-1,30000]
[{"$f":"'Org structure'!E70","v":0},null,0,0,0,0,0,0,0,"",0]
[{"$f":"'Org structure'!E71","v":0},null,0,0,0,0,0,0,0,"",0]
[{"$f":"'Org structure'!E72","v":0},null,0,0,0,0,0,0,0,"",0]
[{"$f":"'Org structure'!E73","v":0},null,0,0,0,0,0,0,0,"",0]
[{"$f":"'Org structure'!E74","v":0},null,0,0,0,0,0,0,0,"",0]
[{"$f":"'Org structure'!E75","v":0},null,0,0,0,0,0,0,0,"",0]
[{"$f":"'Org structure'!E76","v":0},null,0,0,0,0,0,0,0,"",0]
[{"$f":"'Org structure'!E77","v":0},null,0,0,0,0,0,0,0,"",0]
[{"$f":"'Org structure'!E78","v":0},null,0,0,0,0,0,0,0,"",0]
["Vote 8 - Planning and Development",null,{"$f":"SUM(C84:C93)","v":132745},{"$f":"SUM(D84:D93)","v":938955},938955,2254590,2370825,469476,1901349,4.0499386550111192,938955]
[{"$f":"'Org structure'!E80","v":"8.1 - Town Planning, Building Regulations and Enforcement, and City Engineer"},null,132745,938955,938955,2254590,2370825,469476,1901349,4.0499386550111192,938955]
[{"$f":"'Org structure'!E81","v":"8.2 - Development Facilitation"},null,0,0,0,0,0,0,0,"",0]
[{"$f":"'Org structure'!E82","v":"8.3 - Economic Development/Planning"},null,0,0,0,0,0,0,0,"",0]
[{"$f":"'Org structure'!E83","v":"8.4 - Regional Planning and Development"},null,0,0,0,0,0,0,0,"",0]
[{"$f":"'Org structure'!E84","v":"8.5 - Corporate Wide Strategic Planning (IDPs, LEDs)"},null,0,0,0,0,0,0,0,"",0]
[{"$f":"'Org structure'!E85","v":"8.6 - Project Management Unit"},null,0,0,0,0,0,0,0,"",0]
[{"$f":"'Org structure'!E86","v":0},null,0,0,0,0,0,0,0,"",0]
[{"$f":"'Org structure'!E87","v":0},null,0,0,0,0,0,0,0,"",0]
[{"$f":"'Org structure'!E88","v":0},null,0,0,0,0,0,0,0,"",0]
[{"$f":"'Org structure'!E89","v":0},null,0,0,0,0,0,0,0,"",0]
["Vote 9 - Sport and Recreation",null,{"$f":"SUM(C95:C104)","v":24941},{"$f":"SUM(D95:D104)","v":0},0,0,0,0,0,"",0]
[{"$f":"'Org structure'!E91","v":"9.1 - Sports Grounds and Stadiums"},null,24941,0,0,0,0,0,0,"",0]
[{"$f":"'Org structure'!E92","v":0},null,0,0,0,0,0,0,0,""]
[{"$f":"'Org structure'!E93","v":0},null,0,0,0,0,0,0,0,""]
[{"$f":"'Org structure'!E94","v":0},null,0,0,0,0,0,0,0,""]
[{"$f":"'Org structure'!E95","v":0},null,0,0,0,0,0,0,0,""]
[{"$f":"'Org structure'!E96","v":0},null,0,0,0,0,0,0,0,""]
[{"$f":"'Org structure'!E97","v":0},null,0,0,0,0,0,0,0,""]
[{"$f":"'Org structure'!E98","v":0},null,0,0,0,0,0,0,0,""]
[{"$f":"'Org structure'!E99","v":0},null,0,0,0,0,0,0,0,""]
[{"$f":"'Org structure'!E100","v":0},null,0,0,0,0,0,0,0,""]
["Vote 10 - Public Safety",null,{"$f":"SUM(C106:C115)","v":0},{"$f":"SUM(D106:D115)","v":0},0,0,0,0,0,"",0]
[{"$f":"'Org structure'!E102","v":"10.1 - Fire Fighting and Protection"},null,null,null,null,null,null,null,0,""]
[{"$f":"'Org structure'!E103","v":"10.2 - Fencing and Fences"},null,null,null,null,null,null,null,0,""]
[{"$f":"'Org structure'!E104","v":0},null,null,null,null,null,null,null,0,""]
[{"$f":"'Org structure'!E105","v":0},null,null,null,null,null,null,null,0,""]
[{"$f":"'Org structure'!E106","v":0},null,null,null,null,null,null,null,0,""]
[{"$f":"'Org structure'!E107","v":0},null,null,null,null,null,null,null,0,""]
[{"$f":"'Org structure'!E108","v":0},null,null,null,null,null,null,null,0,""]
[{"$f":"'Org structure'!E109","v":0},null,null,null,null,null,null,null,0,""]
[{"$f":"'Org structure'!E110","v":0},null,null,null,null,null,null,null,0,""]
[{"$f":"'Org structure'!E111","v":0},null,null,null,null,null,null,null,0,""]
["Vote 11 - Other",null,{"$f":"SUM(C117:C126)","v":4704487},{"$f":"SUM(D117:D126)","v":7121110},7121110,405996,2813363,3560562,-747199,-0.2098542308770357,7121110]
[{"$f":"'Org structure'!E113","v":"11.1 - Licensing and Regulation"},null,4704487,7121110,7121110,405996,2813363,3560562,-747199,-0.2098542308770357,7121110]
[{"$f":"'Org structure'!E114","v":0},null,0,0,0,0,0,0,0,"",0]
[{"$f":"'Org structure'!E115","v":0},null,0,0,0,0,0,0,0,"",0]
[{"$f":"'Org structure'!E116","v":0},null,0,0,0,0,0,0,0,"",0]
[{"$f":"'Org structure'!E117","v":0},null,0,0,0,0,0,0,0,"",0]
[{"$f":"'Org structure'!E118","v":0},null,0,0,0,0,0,0,0,"",0]
[{"$f":"'Org structure'!E119","v":0},null,0,0,0,0,0,0,0,"",0]
[{"$f":"'Org structure'!E120","v":0},null,0,0,0,0,0,0,0,"",0]
[{"$f":"'Org structure'!E121","v":0},null,0,0,0,0,0,0,0,"",0]
[{"$f":"'Org structure'!E122","v":0},null,0,0,0,0,0,0,0,"",0]
["Vote 12 - Waste Management",null,{"$f":"SUM(C128:C137)","v":528201},{"$f":"SUM(D128:D137)","v":574287},574287,44458,266748,287142,-20394,-7.1024092609231676E-2,574287]
[{"$f":"'Org structure'!E124","v":"12.1 - Solid Waste Removal"},null,528201,574287,574287,44458,266748,287142,-20394,-7.1024092609231676E-2,574287]
[{"$f":"'Org structure'!E125","v":"12.2 - Street Cleaning"},null,0,0,0,0,0,0,0,"",0]
[{"$f":"'Org structure'!E126","v":"12.3 - Solid Waste Disposal (Landfill Sites)"},null,0,0,0,0,0,0,0,"",0]
[{"$f":"'Org structure'!E127","v":0},null,0,0,0,0,0,0,0,"",0]
[{"$f":"'Org structure'!E128","v":0},null,0,0,0,0,0,0,0,"",0]
[{"$f":"'Org structure'!E129","v":0},null,0,0,0,0,0,0,0,"",0]
[{"$f":"'Org structure'!E130","v":0},null,0,0,0,0,0,0,{"$f":"G134-H134","v":0},{"$f":"IF(I134=0,\"\",I134/H134)","v":""},0]
[{"$f":"'Org structure'!E131","v":0},null,0,0,0,0,0,0,0,"",0]
[{"$f":"'Org structure'!E132","v":0},null,0,0,0,0,0,0,0,"",0]
[{"$f":"'Org structure'!E133","v":0},null,0,0,0,0,0,0,0,"",0]
["Vote 13 - Housing",null,{"$f":"SUM(C139:C148)","v":0},{"$f":"SUM(D139:D148)","v":0},0,0,0,0,0,"",0]
[{"$f":"'Org structure'!E135","v":"13.1 - Housing"},null,null,null,null,null,null,null,0,""]
[{"$f":"'Org structure'!E136","v":0},null,null,null,null,null,null,null,0,""]
[{"$f":"'Org structure'!E137","v":0},null,null,null,null,null,null,null,0,""]
[{"$f":"'Org structure'!E138","v":0},null,null,null,null,null,null,null,0,""]
[{"$f":"'Org structure'!E139","v":0},null,null,null,null,null,null,null,0,""]
[{"$f":"'Org structure'!E140","v":0},null,null,null,null,null,null,null,0,""]
[{"$f":"'Org structure'!E141","v":0},null,null,null,null,null,null,null,0,""]
[{"$f":"'Org structure'!E142","v":0},null,null,null,null,null,null,null,0,""]
[{"$f":"'Org structure'!E143","v":0},null,null,null,null,null,null,null,0,""]
[{"$f":"'Org structure'!E144","v":0},null,null,null,null,null,null,null,0,""]
[{"$f":"'Org structure'!A15","v":"Vote 14 - Waste Water Management"},null,{"$f":"SUM(C150:C159)","v":0},{"$f":"SUM(D150:D159)","v":0},0,0,0,0,0,"",0]
[{"$f":"'Org structure'!E146","v":"14.1 - Storm Water Management"},null,null,null,null,null,null,null,0,""]
[{"$f":"'Org structure'!E147","v":0},null,null,null,null,null,null,null,0,""]
[{"$f":"'Org structure'!E148","v":0},null,null,null,null,null,null,null,0,""]
[{"$f":"'Org structure'!E149","v":0},null,null,null,null,null,null,null,0,""]
[{"$f":"'Org structure'!E150","v":0},null,null,null,null,null,null,null,0,""]
[{"$f":"'Org structure'!E151","v":0},null,null,null,null,null,null,null,0,""]
[{"$f":"'Org structure'!E152","v":0},null,null,null,null,null,null,null,0,""]
[{"$f":"'Org structure'!E153","v":0},null,null,null,null,null,null,null,0,""]
[{"$f":"'Org structure'!E154","v":0},null,null,null,null,null,null,null,0,""]
[{"$f":"'Org structure'!E155","v":0},null,null,null,null,null,null,null,0,""]
[{"$f":"'Org structure'!A16","v":"Vote 15 - Health"},null,{"$f":"SUM(C161:C170)","v":0},{"$f":"SUM(D161:D170)","v":0},0,0,0,0,0,"",0]
[{"$f":"'Org structure'!E157","v":"15.1 - Health Services"},null,null,null,null,null,null,null,0,""]
[{"$f":"'Org structure'!E158","v":"15.2 - Tourism"},null,null,null,null,null,null,null,0,""]
[{"$f":"'Org structure'!E159","v":0},null,null,null,null,null,null,null,0,""]
[{"$f":"'Org structure'!E160","v":0},null,null,null,null,null,null,null,0,""]
[{"$f":"'Org structure'!E161","v":0},null,null,null,null,null,null,null,0,""]
[{"$f":"'Org structure'!E162","v":0},null,null,null,null,null,null,null,0,""]
[{"$f":"'Org structure'!E163","v":0},null,null,null,null,null,null,null,0,""]
[{"$f":"'Org structure'!E164","v":0},null,null,null,null,null,null,null,0,""]
[{"$f":"'Org structure'!E165","v":0},null,null,null,null,null,null,null,0,""]
[{"$f":"'Org structure'!E166","v":0},null,null,null,null,null,null,null,0,"",null,{"$f":"SUM(L78:L81)","v":0},0,0,0,0,0,0,0,0,0,0,0]
["Total Revenue by Vote",2,{"$f":"C6+C17+C28+C39+C50+C61+C72+C83+C94+C105+C116+C127+C138+C149+C160","v":113941101},{"$f":"D6+D17+D28+D39+D50+D61+D72+D83+D94+D105+D116+D127+D138+D149+D160","v":124222455},136627455,38031700,92767117,68313731.019999996,24453385.980000004,0.35795711367076211,136627455]
[null,null,null,null,null,null,null,null,0,""]
["Expenditure by Vote",1,null,null,null,null,null,null,0,""]
["Vote 1 - Finance and Administration",null,{"$f":"SUM(C175:C184)","v":41273109},49901785,49901785,3088270,17556430,24950934,-7394504,-0.29636181154581226,49901785]
["1.1 - Finance",null,12126785,17834080,17834080,964306,3805583,8917056,-5111473,-0.57322427940342646,17834080]
[{"$f":"'Org structure'!E4","v":"1.2 - Fleet Management"},null,1206406,910000,910000,79916,728316,455004,273312,0.6006804335786059,910000]
[{"$f":"'Org structure'!E5","v":"1.3 - Asset Management"},null,10383094,13173339,13173339,810718,5299183,6586668,-1287485,-0.19546833087685611,13173339]
[{"$f":"'Org structure'!E6","v":"1.4 - Administrative and Corporate Support"},null,10731235,11894526,11894526,1028771,4590761,5947272,-1356511,-0.22808961823168672,11894526]
[{"$f":"'Org structure'!E7","v":"1.5 - Human Resources"},null,734652,1099190,1099190,6568,118336,549600,-431264,-0.78468704512372633,1099190]
[{"$f":"'Org structure'!E8","v":"1.6 - Property Services"},null,2250153,2635650,2635650,73857,1104170,1317828,-213658,-0.16212889694254484,2635650]
[{"$f":"'Org structure'!E9","v":"1.7 - Legal Services"},null,333462,500000,500000,393,393052,250002,143050,0.57219542243662047,500000]
[{"$f":"'Org structure'!E10","v":"1.8 - Information Technology"},null,3460653,1595000,1595000,45338,1437768,797502,640266,0.80283936592008542,1595000]
[{"$f":"'Org structure'!E11","v":"1.9 - Marketing, Customer Relations, Publicity and Media Co-ordination"},null,0,0,0,0,0,0,0,"",0]
[{"$f":"'Org structure'!E12","v":"1.10 - Valuation Service"},null,46669,260000,260000,78403,79261,130002,-50741,-0.39030937985569453,260000]
["Vote 2 - Finance and Administration2",null,{"$f":"SUM(C186:C195)","v":70542},{"$f":"SUM(D186:D195)","v":650000},{"$f":"SUM(E186:E195)","v":650000},105975,106482,325002,-218520,-0.67236509313788839,650000]
[{"$f":"'Org structure'!E14","v":"2.1 - Supply Chain Management"},null,70542,650000,650000,105975,106482,325002,-218520,-0.67236509313788839,650000]
[{"$f":"'Org structure'!E15","v":0},null,0,0,0,0,0,0,0,"",0]
[{"$f":"'Org structure'!E16","v":0},null,0,0,0,0,0,0,0,"",0]
[{"$f":"'Org structure'!E17","v":0},null,0,0,0,0,0,0,0,"",0]
[{"$f":"'Org structure'!E18","v":0},null,0,0,0,0,0,0,0,"",0]
[{"$f":"'Org structure'!E19","v":0},null,0,0,0,0,0,0,0,"",0]
[{"$f":"'Org structure'!E20","v":0},null,0,0,0,0,0,0,0,"",0]
[{"$f":"'Org structure'!E21","v":0},null,0,0,0,0,0,0,0,"",0]
[{"$f":"'Org structure'!E22","v":0},null,0,0,0,0,0,0,0,"",0]
[{"$f":"'Org structure'!E23","v":0},null,0,0,0,0,0,0,0,"",0]
[{"$f":"'Org structure'!A4","v":"Vote 3 - Executive and Council"},null,{"$f":"SUM(C197:C206)","v":12619987},19001756,19001756,1315393,8160601,9500880,-1340279,-0.14106893256203637,19001755.550000001]
[{"$f":"'Org structure'!E25","v":"3.1 - Municipal Manager, Town Secretary and Chief Executive"},null,3639842,11544835,11544835,603553,3960540,5772408,-1811868,-0.31388425766162059,11544834.820000002]
[{"$f":"'Org structure'!E26","v":"3.2 - Mayor and Council"},null,8980145,7456921,7456921,711840,4200061,3728472,{"$f":"G198-H198","v":471589},{"$f":"IF(I198=0,\"\",I198/H198)","v":0.12648318131395381},7456920.7299999995]
[{"$f":"'Org structure'!E27","v":0},null,0,0,0,0,0,0,0,"",0]
[{"$f":"'Org structure'!E28","v":0},null,0,0,0,0,0,0,0,"",0]
[{"$f":"'Org structure'!E29","v":0},null,0,0,0,0,0,0,0,"",0]
[{"$f":"'Org structure'!E30","v":0},null,0,0,0,0,0,0,0,"",0]
[{"$f":"'Org structure'!E31","v":0},null,0,0,0,0,0,0,0,"",0]
[{"$f":"'Org structure'!E32","v":0},null,0,0,0,0,0,0,0,"",0]
[{"$f":"'Org structure'!E33","v":0},null,0,0,0,0,0,0,0,"",0]
[{"$f":"'Org structure'!E34","v":0},null,0,0,0,0,0,0,0,"",0]
[{"$f":"'Org structure'!A5","v":"Vote 4 - Community and Social Services"},null,{"$f":"SUM(C208:C217)","v":5196950},9157704,9157704,1331707,3218777,4578888,-1360111,-0.29703958690406929,9157704]
[{"$f":"'Org structure'!E36","v":"4.1 - Disaster Management"},null,347962,1430000,1430000,239413,384318,715002,-330684,-0.46249381120612248,1430000]
[{"$f":"'Org structure'!E37","v":"4.2 - Libraries and Archives"},null,2080138,2919704,2919704,339878,1114263,1459860,-345597,-0.23673297439480498,2919704]
[{"$f":"'Org structure'!E38","v":"4.3 - Population Development"},null,1035039,2906500,2906500,172432,811686,1453266,-641580,-0.44147458207926149,2906500]
[{"$f":"'Org structure'!E39","v":"4.4 - Cultural Matters"},null,209824,620000,620000,303412,606938,310008,296930,0.95781399189698335,620000]
[{"$f":"'Org structure'!E40","v":"4.5 - Indigenous and Customary Law"},null,98912,261500,261500,0,0,130752,-130752,-1,261500]
[{"$f":"'Org structure'!E41","v":"4.6 - Industrial Promotion"},null,0,380000,380000,0,0,190002,-190002,-1,380000]
[{"$f":"'Org structure'!E42","v":"4.7 - Agricultural"},null,179642,150000,150000,0,0,75000,-75000,-1,150000]
[{"$f":"'Org structure'!E43","v":"4.8 - Aged Care"},null,237085,490000,490000,301572,301572,244998,56574,0.23091617074425097,490000]
[{"$f":"'Org structure'!E44","v":"4.9 - Child Care Facilities"},null,1008348,0,0,-25000,0,0,0,"",0]
[{"$f":"'Org structure'!E45","v":"4.10 - Animal Care and Diseases"},null,0,0,0,0,0,0,0,"",0]
[{"$f":"'Org structure'!A6","v":"Vote 5 - Community and Social Services2"},null,{"$f":"SUM(C219:C228)","v":8842916},12212528,12212528,1636030,6839881,6106266,733615,0.12014134333486291,12212527.289999999]
[{"$f":"'Org structure'!E47","v":"5.1 - Literacy Programmes"},null,859950,2320000,2320000,0,0,1159998,-1159998,-1,2320000]
[{"$f":"'Org structure'!E48","v":"5.2 - Education"},null,405345,190000,190000,0,91500,95004,-3504,-3.6882657572312745E-2,190000]
[{"$f":"'Org structure'!E49","v":"5.3 - Community Halls and Facilities"},null,7577621,9702528,9702528,1636030,6748381,4851264,1897117,0.39105622782021343,9702527.2899999991]
[{"$f":"'Org structure'!E50","v":0},null,0,0,0,0,0,0,0,"",0]
[{"$f":"'Org structure'!E51","v":0},null,0,0,0,0,0,0,0,"",0]
[{"$f":"'Org structure'!E52","v":0},null,0,0,0,0,0,0,0,"",0]
[{"$f":"'Org structure'!E53","v":0},null,0,0,0,0,0,0,0,"",0]
[{"$f":"'Org structure'!E54","v":0},null,0,0,0,0,0,0,0,"",0]
[{"$f":"'Org structure'!E55","v":0},null,0,0,0,0,0,0,0,"",0]
[{"$f":"'Org structure'!E56","v":0},null,0,0,0,0,0,0,0,"",0]
[{"$f":"'Org structure'!A7","v":"Vote 6 - Energy Sources"},null,{"$f":"SUM(C230:C239)","v":6223503},0,0,1819983,2980791,0,2980791,{"$error":"#DIV/0!"},0]
[{"$f":"'Org structure'!E58","v":"6.1 - Electricity"},null,6223503,0,0,1819983,2980791,0,2980791,{"$error":"#DIV/0!"},0]
[{"$f":"'Org structure'!E59","v":0},null,0,0,0,0,0,0,0,"",0]
[{"$f":"'Org structure'!E60","v":0},null,0,0,0,0,0,0,0,"",0]
[{"$f":"'Org structure'!E61","v":0},null,0,0,0,0,0,0,0,"",0]
[{"$f":"'Org structure'!E62","v":0},null,0,0,0,0,0,0,0,"",0]
[{"$f":"'Org structure'!E63","v":0},null,0,0,0,0,0,0,0,"",0]
[{"$f":"'Org structure'!E64","v":0},null,0,0,0,0,0,0,0,"",0]
[{"$f":"'Org structure'!E65","v":0},null,0,0,0,0,0,0,0,"",0]
[{"$f":"'Org structure'!E66","v":0},null,0,0,0,0,0,0,0,"",0]
[{"$f":"'Org structure'!E67","v":0},null,0,0,0,0,0,0,0,"",0]
[{"$f":"'Org structure'!A8","v":"Vote 7 - Road Transport"},null,{"$f":"SUM(C241:C250)","v":10289238},17376674,17376674,775216,16868000,8688336,8179664,0.94145346128418606,17376673.849999998]
[{"$f":"'Org structure'!E69","v":"7.1 - Roads"},null,10289238,17376674,17376674,775216,16868000,8688336,8179664,0.94145346128418606,17376673.849999998]
[{"$f":"'Org structure'!E70","v":0},null,0,0,0,0,0,0,0,""]
[{"$f":"'Org structure'!E71","v":0},null,0,0,0,0,0,0,0,""]
[{"$f":"'Org structure'!E72","v":0},null,0,0,0,0,0,0,0,""]
[{"$f":"'Org structure'!E73","v":0},null,0,0,0,0,0,0,0,""]
[{"$f":"'Org structure'!E74","v":0},null,0,0,0,0,0,0,0,""]
[{"$f":"'Org structure'!E75","v":0},null,0,0,0,0,0,0,0,""]
[{"$f":"'Org structure'!E76","v":0},null,0,0,0,0,0,0,0,""]
[{"$f":"'Org structure'!E77","v":0},null,0,0,0,0,0,0,0,""]
[{"$f":"'Org structure'!E78","v":0},null,0,0,0,0,0,0,0,""]
[{"$f":"'Org structure'!A9","v":"Vote 8 - Planning and Development"},null,{"$f":"SUM(C252:C261)","v":1694782},580000,580000,15000,49777,290004,-240227,-0.82835753989600147,440000]
[{"$f":"'Org structure'!E80","v":"8.1 - Town Planning, Building Regulations and Enforcement, and City Engineer"},null,249511,440000,440000,15000,39997,220002,-180005,-0.81819710729902451,440000]
[{"$f":"'Org structure'!E81","v":"8.2 - Development Facilitation"},null,0,0,0,0,0,0,0,"",0]
[{"$f":"'Org structure'!E82","v":"8.3 - Economic Development/Planning"},null,1445271,140000,140000,0,9780,70002,-60222,-0.86028970600839971,0]
[{"$f":"'Org structure'!E83","v":"8.4 - Regional Planning and Development"},null,0,0,0,0,0,0,0,"",0]
[{"$f":"'Org structure'!E84","v":"8.5 - Corporate Wide Strategic Planning (IDPs, LEDs)"},null,0,0,0,0,0,0,0,"",0]
[{"$f":"'Org structure'!E85","v":"8.6 - Project Management Unit"},null,0,0,0,0,0,0,0,"",0]
[{"$f":"'Org structure'!E86","v":0},null,0,0,0,0,0,0,0,"",0]
[{"$f":"'Org structure'!E87","v":0},null,0,0,0,0,0,0,0,"",0]
[{"$f":"'Org structure'!E88","v":0},null,0,0,0,0,0,0,0,"",0]
[{"$f":"'Org structure'!E89","v":0},null,0,0,0,0,0,0,0,"",0]
[{"$f":"'Org structure'!A10","v":"Vote 9 - Sport and Recreation"},null,{"$f":"SUM(C263:C272)","v":4086381},3300000,3300000,430184,1003747,1650018,{"$f":"G262-H262","v":-646271},{"$f":"IF(I262=0,\"\",I262/H262)","v":-0.39167512111989083},3300000]
[{"$f":"'Org structure'!E91","v":"9.1 - Sports Grounds and Stadiums"},null,4086381,3300000,3300000,430184,1003747,1650018,-646271,-0.39167512111989083,3300000]
[{"$f":"'Org structure'!E92","v":0},null,0,0,0,0,0,0,0,"",0]
[{"$f":"'Org structure'!E93","v":0},null,0,0,0,0,0,0,0,"",0]
[{"$f":"'Org structure'!E94","v":0},null,0,0,0,0,0,0,0,"",0]
[{"$f":"'Org structure'!E95","v":0},null,0,0,0,0,0,0,0,"",0]
[{"$f":"'Org structure'!E96","v":0},null,0,0,0,0,0,0,0,"",0]
[{"$f":"'Org structure'!E97","v":0},null,0,0,0,0,0,0,0,"",0]
[{"$f":"'Org structure'!E98","v":0},null,0,0,0,0,0,0,0,"",0]
[{"$f":"'Org structure'!E99","v":0},null,0,0,0,0,0,0,0,"",0]
[{"$f":"'Org structure'!E100","v":0},null,0,0,0,0,0,0,0,"",0]
[{"$f":"'Org structure'!A11","v":"Vote 10 - Public Safety"},null,{"$f":"SUM(C274:C283)","v":1704},15000,15000,0,0,7500,-7500,-1,15000]
[{"$f":"'Org structure'!E102","v":"10.1 - Fire Fighting and Protection"},null,1704,15000,15000,0,0,7500,-7500,-1,15000]
[{"$f":"'Org structure'!E103","v":"10.2 - Fencing and Fences"},null,0,0,0,0,0,0,0,"",0]
[{"$f":"'Org structure'!E104","v":0},null,0,0,0,0,0,0,0,"",0]
[{"$f":"'Org structure'!E105","v":0},null,0,0,0,0,0,0,0,"",0]
[{"$f":"'Org structure'!E106","v":0},null,0,0,0,0,0,0,0,"",0]
[{"$f":"'Org structure'!E107","v":0},null,0,0,0,0,0,0,0,"",0]
[{"$f":"'Org structure'!E108","v":0},null,0,0,0,0,0,0,0,"",0]
[{"$f":"'Org structure'!E109","v":0},null,0,0,0,0,0,0,0,"",0]
[{"$f":"'Org structure'!E110","v":0},null,0,0,0,0,0,0,0,"",0]
[{"$f":"'Org structure'!E111","v":0},null,0,0,0,0,0,0,0,"",0]
[{"$f":"'Org structure'!A12","v":"Vote 11 - Other"},null,{"$f":"SUM(C285:C294)","v":3826636},6513455,6513455,156420,333112,3256728,-2923616,-0.8977157441456578,6513454.54]
[{"$f":"'Org structure'!E113","v":"11.1 - Licensing and Regulation"},null,3826636,6513455,6513455,156420,333112,3256728,-2923616,-0.8977157441456578,6513454.54]
[{"$f":"'Org structure'!E114","v":0},null,0,0,0,0,0,0,0,"",0]
[{"$f":"'Org structure'!E115","v":0},null,0,0,0,0,0,0,0,"",0]
[{"$f":"'Org structure'!E116","v":0},null,0,0,0,0,0,0,0,"",0]
[{"$f":"'Org structure'!E117","v":0},null,0,0,0,0,0,0,0,"",0]
[{"$f":"'Org structure'!E118","v":0},null,0,0,0,0,0,0,0,"",0]
[{"$f":"'Org structure'!E119","v":0},null,0,0,0,0,0,0,0,"",0]
[{"$f":"'Org structure'!E120","v":0},null,0,0,0,0,0,0,0,"",0]
[{"$f":"'Org structure'!E121","v":0},null,0,0,0,0,0,0,0,"",0]
[{"$f":"'Org structure'!E122","v":0},null,0,0,0,0,0,0,0,"",0]
[{"$f":"'Org structure'!A13","v":"Vote 12 - Waste Management"},null,{"$f":"SUM(C296:C305)","v":2625560},2558000,2558000,208824,858834,1279008,-420174,-0.32851553704120695,2558000]
[{"$f":"'Org structure'!E124","v":"12.1 - Solid Waste Removal"},null,2565082,2138000,2138000,208824,825169,1069008,-243839,-0.22809838654154133,2138000]
[{"$f":"'Org structure'!E125","v":"12.2 - Street Cleaning"},null,0,40000,40000,0,31565,19998,11567,0.57840784078407836,40000]
[{"$f":"'Org structure'!E126","v":"12.3 - Solid Waste Disposal (Landfill Sites)"},null,60478,380000,380000,0,2100,190002,-187902,-0.98894748476331829,380000]
[{"$f":"'Org structure'!E127","v":0},null,0,0,0,0,0,0,0,"",0]
[{"$f":"'Org structure'!E128","v":0},null,0,0,0,0,0,0,0,"",0]
[{"$f":"'Org structure'!E129","v":0},null,0,0,0,0,0,0,0,"",0]
[{"$f":"'Org structure'!E130","v":0},null,0,0,0,0,0,0,0,"",0]
[{"$f":"'Org structure'!E131","v":0},null,0,0,0,0,0,0,0,"",0]
[{"$f":"'Org structure'!E132","v":0},null,0,0,0,0,0,0,0,"",0]
[{"$f":"'Org structure'!E133","v":0},null,0,0,0,0,0,0,0,"",0]
[{"$f":"'Org structure'!A14","v":"Vote 13 - Housing"},null,{"$f":"SUM(C307:C316)","v":0},0,0,0,0,0,0,"",0]
[{"$f":"'Org structure'!E135","v":"13.1 - Housing"},null,null,null,null,null,null,null,0,""]
[{"$f":"'Org structure'!E136","v":0},null,null,null,null,null,null,null,0,""]
[{"$f":"'Org structure'!E137","v":0},null,null,null,null,null,null,null,0,""]
[{"$f":"'Org structure'!E138","v":0},null,null,null,null,null,null,null,0,""]
[{"$f":"'Org structure'!E139","v":0},null,null,null,null,null,null,null,0,""]
[{"$f":"'Org structure'!E140","v":0},null,null,null,null,null,null,null,0,""]
[{"$f":"'Org structure'!E141","v":0},null,null,null,null,null,null,null,0,""]
[{"$f":"'Org structure'!E142","v":0},null,null,null,null,null,null,null,0,""]
[{"$f":"'Org structure'!E143","v":0},null,null,null,null,null,null,null,0,""]
[{"$f":"'Org structure'!E144","v":0},null,null,null,null,null,null,null,0,""]
[{"$f":"'Org structure'!A15","v":"Vote 14 - Waste Water Management"},null,{"$f":"SUM(C318:C327)","v":0},0,0,0,0,0,0,"",0]
[{"$f":"'Org structure'!E146","v":"14.1 - Storm Water Management"},null,null,null,null,null,null,null,0,""]
[{"$f":"'Org structure'!E147","v":0},null,null,null,null,null,null,null,0,""]
[{"$f":"'Org structure'!E148","v":0},null,null,null,null,null,null,null,0,""]
[{"$f":"'Org structure'!E149","v":0},null,null,null,null,null,null,null,0,""]
[{"$f":"'Org structure'!E150","v":0},null,null,null,null,null,null,null,0,""]
[{"$f":"'Org structure'!E151","v":0},null,null,null,null,null,null,null,0,""]
[{"$f":"'Org structure'!E152","v":0},null,null,null,null,null,null,null,0,""]
[{"$f":"'Org structure'!E153","v":0},null,null,null,null,null,null,null,0,""]
[{"$f":"'Org structure'!E154","v":0},null,null,null,null,null,null,null,{"$f":"G326-H326","v":0},{"$f":"IF(I326=0,\"\",I326/H326)","v":""}]
[{"$f":"'Org structure'!E155","v":0},null,null,null,null,null,null,null,0,""]
[{"$f":"'Org structure'!A16","v":"Vote 15 - Health"},null,{"$f":"SUM(C329:C338)","v":115416},270000,270000,95585,443414,135000,308414,2.284548148148148,270000]
[{"$f":"'Org structure'!E157","v":"15.1 - Health Services"},null,115416,270000,270000,95585,110165,135000,-24835,-0.18396296296296297,270000]
[{"$f":"'Org structure'!E158","v":"15.2 - Tourism"},null,0,0,0,0,333249,0,333249,{"$error":"#DIV/0!"},0]
[{"$f":"'Org structure'!E159","v":0},null,0,0,0,0,0,0,0,"",0]
[{"$f":"'Org structure'!E160","v":0},null,0,0,0,0,0,0,0,"",0]
[{"$f":"'Org structure'!E161","v":0},null,0,0,0,0,0,0,0,"",0]
[{"$f":"'Org structure'!E162","v":0},null,0,0,0,0,0,0,0,"",0]
[{"$f":"'Org structure'!E163","v":0},null,0,0,0,0,0,0,0,"",0]
[{"$f":"'Org structure'!E164","v":0},null,0,0,0,0,0,0,0,"",0]
[{"$f":"'Org structure'!E165","v":0},null,0,0,0,0,0,0,0,"",0]
[{"$f":"'Org structure'!E166","v":0},null,0,0,0,0,0,0,0,"",0,{"$f":"SUM(L173:L249)","v":0},0,0,0,0,0,0,0,0,0,0,0]
["Total Expenditure by Vote",2,{"$f":"C174+C185+C196+C207+C218+C229+C240+C251+C262++C273+C284+C295+C306+C317+C328","v":96866724},121536902,121536902,10978587,58419846,60768564,-2348718,-3.8650213949436095E-2,{"$f":"K174+K185+K196+K207+K218+K229+K240+K251+K262++K273+K284+K295+K306+K317+K328","v":121396900.23}]
[null,null,null,null,null,null,null,null,0,"",null,{"$f":"L170-L338","v":0},0,0,0,0,0,0,0,0,0,0,0]
[{"$f":"result","v":"Surplus/ (Deficit) for the year"},2,{"$f":"C171-C339","v":17074377},2685553,15090553,27053113,34347271,7545167.0199999958,26802103.980000004,3.5522214298180002,{"$f":"K171-K339","v":15230554.769999996}]
[{"$f":"head27a","v":"References"}]
["1. Insert 'Vote'; e.g. Department, if different to standard structure"]
["2. Must reconcile to Financial Performance ('Revenue and Expenditure by Standard Classification' and 'Revenue and Expenditure')"]
["3. Assign share in 'associate' to relevant Vote"]
[]
["check revenue"]
["check expenditure"]

{"sheet":"C4-FinPerf RE","index":11,"n_rows":53,"n_cols":11,"rows_kept":53,"cut":false,"hidden":false,"merged":[[1,0,2,0],[1,1,2,1],[1,3,1,10],[0,0,0,10]]}
[{"$f":"muni& \" - \"&S71B& \" - \"&date","v":"Choose name from list - Table C4 Monthly Budget Statement - Financial Performance (revenue and expenditure) - Mid-Year Assessment"}]
[{"$f":"desc","v":"Description"},{"$f":"head27","v":"Ref"},{"$f":"Head1","v":"2019/20"},{"$f":"Head2","v":"Budget Year 2020/21"}]
[null,null,{"$f":"Head5","v":"Audited Outcome"},{"$f":"Head6","v":"Original Budget"},{"$f":"Head7","v":"Adjusted Budget"},{"$f":"Head38","v":"Monthly actual"},{"$f":"Head39","v":"YearTD actual"},{"$f":"Head40","v":"YearTD budget"},{"$f":"Head41","v":"YTD variance"},{"$f":"Head41","v":"YTD variance"},{"$f":"Head8","v":"Full Year Forecast"}]
["R thousands",null,null,null,null,null,null,null,null,"%"]
["Revenue By Source"]
["Property rates",null,17367687,19781622,19781622,1599529,9597548,9890813.0199999996,{"$f":"G6-H6","v":-293265.01999999955},{"$f":"IF(I6=0,\"\",I6/H6)","v":-2.9650244060523103E-2},19781622]
["Service charges - electricity revenue",null,0,0,0,0,0,0,0,"",0]
["Service charges - water revenue",null,0,0,0,0,0,0,0,"",0]
["Service charges - sanitation revenue",null,0,0,0,0,0,0,0,"",0]
["Service charges - refuse revenue",null,528201,574287,574287,44458,266748,287142,-20394,-7.1024092609231676E-2,574287]
[]
["Rental of facilities and equipment",null,248300,345181,345181,0,0,172590,-172590,-1,345181]
["Interest earned - external investments",null,4285972,3850000,3850000,127274,892752,1924998,-1032246,-0.53623224543609915,3850000]
["Interest earned - outstanding debtors",null,959570,1883321,1883321,0,0,941658,-941658,-1,1883321]
["Dividends received",null,0,0,0,0,0,0,0,"",0]
["Fines, penalties and forfeits",null,24635,34200,34200,0,3,17100,-17097,-0.99982456140350873,34200]
["Licences and permits",null,4704487,7121110,7121110,405996,2813363,3560562,-747199,-0.2098542308770357,7121110]
["Agency services",null,0,0,0,0,0,0,0,"",0]
["Transfers and subsidies",null,69092059,73462500,85867500,33239068,65605750,42933750,22672000,0.52806940926427348,85867500]
["Other revenue",null,534287,1174234,1174234,2282272,2474036,587118,1886918,3.2138650152098895,1174234]
["Gains",null,0,0,0,0,0,0,0,""]
["Total Revenue (excluding capital transfers and contributions)",null,{"$f":"SUM(C6:C10)+SUM(C12:C21)","v":97745198},108226455,120631455,37698597,81650200,60315731.019999996,21334468.980000004,0.35371317928528034,{"$f":"SUM(K6:K10)+SUM(K12:K21)","v":120631455}]
[]
["Expenditure By Type"]
["Employee related costs",null,36529095,44691585,44691585,5121303,20700872,22345806,{"$f":"G25-H25","v":-1644934},{"$f":"IF(I25=0,\"\",I25/H25)","v":-7.3612650176950428E-2},44691612]
["Remuneration of councillors",null,6023555,6373921,6373921,501793,2973759,3186966,-213207,-6.6899678251980094E-2,6373932]
["Debt impairment",null,590455,3140135,3140135,0,0,1570068,-1570068,-1,3140136]
["Depreciation & asset impairment",null,9318525,11173339,11173339,810718,4806692,5586666,-779974,-0.13961350114719584,11173332]
["Finance charges",null,4109,0,0,0,4206,0,4206,{"$error":"#DIV/0!"},0]
["Bulk purchases",null,0,0,0,0,0,0,0,"",0]
["Other materials",null,2898053,6366500,6366500,321575,2389087,3183264,-794177,-0.24948511967590498,6366528]
["Contracted services",null,27529769,30419837,30419837,489021,18825388,15209964,3615424,0.23770102282950833,30419928]
["Transfers and subsidies",null,0,309425,309425,0,66285,154710,-88425,-0.57155322862129143,309420]
["Other expenditure",null,13859878,19062160,19062160,3734177,8653557,9531120,-877563,-9.2073439427895143E-2,19062240]
["Losses",null,113285,0,0,0,0,0,0,"",0]
["Total Expenditure",null,{"$f":"SUM(C25:C35)","v":96866724},{"$f":"SUM(D25:D35)","v":121536902},{"$f":"SUM(E25:E35)","v":121536902},10978587,58419846,60768564,-2348718,-3.8650213949436095E-2,121537128]
[]
["Surplus/(Deficit)",null,{"$f":"C22-C36","v":878474},-13310447,-905447,26720010,23230354,-452832.98000000417,{"$f":"I22-I36","v":23683186.980000004},-52.300048861281674,{"$f":"K22-K36","v":-905673}]
["Transfers and subsidies - capital (monetary allocations) (National / Provincial and District)",null,16076001,15996000,15996000,333103,11106881,7998000,{"$f":"G39-H39","v":3108881},0.38870730182545637,15996000]
["Transfers and subsidies - capital (monetary allocations) (National / Provincial Departmental Agencies, Households, Non-profit Institutions, Private Enterprises, Public Corporatons, Higher Educational Institutions)",null,null,null,null,null,null,null,{"$f":"G40-H40","v":0},""]
["Transfers and subsidies - capital (in-kind - all) ",null,null,null,null,null,10036,null,{"$f":"G41-H41","v":10036},{"$error":"#DIV/0!"}]
["Surplus/(Deficit) after capital transfers & contributions",null,{"$f":"C38+SUM(C39:C41)","v":16954475},2685553,15090553,27053113,34347271,7545167.0199999958,null,null,{"$f":"K38+SUM(K39:K41)","v":15090327}]
["Taxation",null,null,null,null,null,null,null,{"$f":"G43-H43","v":0},{"$f":"IF(I43=0,\"\",I43/H43)","v":""}]
["Surplus/(Deficit) after taxation",null,{"$f":"C42-C43","v":16954475},2685553,15090553,27053113,34347271,7545167.0199999958,null,null,{"$f":"K42-K43","v":15090327}]
["Attributable to minorities"]
["Surplus/(Deficit) attributable to municipality",null,{"$f":"SUM(C44:C45)","v":16954475},2685553,15090553,27053113,34347271,7545167.0199999958,null,null,{"$f":"SUM(K44:K45)","v":15090327}]
["Share of surplus/ (deficit) of associate"]
["Surplus/ (Deficit) for the year",null,{"$f":"C46+C47","v":16954475},2685553,15090553,27053113,34347271,7545167.0199999958,null,null,{"$f":"K46+K47","v":15090327}]
[{"$f":"head27a","v":"References"}]
["1. Material variances to be explained on Table SC1"]
[]
[]
[{"$f":"A22&\" including capital transfers/contributions etc\"","v":"Total Revenue (excluding capital transfers and contributions) including capital transfers/contributions etc"},null,{"$f":"C22+SUM(C39:C41)","v":113821199},124222455,136627455,38031700,92767117,68313731.019999996,null,null,{"$f":"K22+SUM(K39:K41)","v":136627455}]

{"sheet":"C5-Capex","index":12,"n_rows":86,"n_cols":11,"rows_kept":86,"cut":false,"hidden":false,"merged":[[0,0,0,10],[76,0,76,10],[78,0,78,10],[77,0,77,10],[1,0,2,0],[1,1,2,1]]}
[{"$f":"muni& \" - \"&S71D& \" - \"&date","v":"Choose name from list - Table C5 Monthly Budget Statement - Capital Expenditure (municipal vote, functional classification and funding) - Mid-Year Assessment"}]
[{"$f":"Vdesc","v":"Vote Description"},{"$f":"head27","v":"Ref"},{"$f":"Head1","v":"2019/20"},{"$f":"Head2","v":"Budget Year 2020/21"}]
[null,null,{"$f":"Head5","v":"Audited Outcome"},{"$f":"Head6","v":"Original Budget"},{"$f":"Head7","v":"Adjusted Budget"},{"$f":"Head38","v":"Monthly actual"},{"$f":"Head39","v":"YearTD actual"},{"$f":"Head40","v":"YearTD budget"},{"$f":"Head41","v":"YTD variance"},{"$f":"Head41","v":"YTD variance"},{"$f":"Head8","v":"Full Year Forecast"}]
["R thousands",1,null,null,null,null,null,null,null,"%"]
["Multi-Year expenditure appropriation",2]
[{"$f":"'Org structure'!A2","v":"Vote 1 - Finance and Administration"},null,{"$f":"'C5C'!C7","v":0},{"$f":"'C5C'!D7","v":0},{"$f":"'C5C'!E7","v":0},{"$f":"'C5C'!F7","v":0},{"$f":"'C5C'!G7","v":0},{"$f":"'C5C'!H7","v":0},{"$f":"G6-H6","v":0},{"$f":"IF(I6=0,\"\",I6/H6)","v":""},{"$f":"'C5C'!K7","v":0}]
[{"$f":"'Org structure'!A3","v":"Vote 2 - Finance and Administration2"},null,{"$f":"'C5C'!C18","v":0},{"$f":"'C5C'!D18","v":0},{"$f":"'C5C'!E18","v":0},{"$f":"'C5C'!F18","v":0},{"$f":"'C5C'!G18","v":0},{"$f":"'C5C'!H18","v":0},{"$f":"G7-H7","v":0},{"$f":"IF(I7=0,\"\",I7/H7)","v":""},{"$f":"'C5C'!K18","v":0}]
[{"$f":"'Org structure'!A4","v":"Vote 3 - Executive and Council"},null,{"$f":"'C5C'!C29","v":0},{"$f":"'C5C'!D29","v":0},{"$f":"'C5C'!E29","v":0},{"$f":"'C5C'!F29","v":0},{"$f":"'C5C'!G29","v":0},{"$f":"'C5C'!H29","v":0},{"$f":"G8-H8","v":0},{"$f":"IF(I8=0,\"\",I8/H8)","v":""},{"$f":"'C5C'!K29","v":0}]
[{"$f":"'Org structure'!A5","v":"Vote 4 - Community and Social Services"},null,{"$f":"'C5C'!C40","v":0},{"$f":"'C5C'!D40","v":0},{"$f":"'C5C'!E40","v":0},{"$f":"'C5C'!F40","v":0},{"$f":"'C5C'!G40","v":0},{"$f":"'C5C'!H40","v":0},0,"",{"$f":"'C5C'!K40","v":0}]
[{"$f":"'Org structure'!A6","v":"Vote 5 - Community and Social Services2"},null,{"$f":"'C5C'!C51","v":0},{"$f":"'C5C'!D51","v":0},{"$f":"'C5C'!E51","v":0},{"$f":"'C5C'!F51","v":0},{"$f":"'C5C'!G51","v":0},{"$f":"'C5C'!H51","v":0},0,"",{"$f":"'C5C'!K51","v":0}]
[{"$f":"'Org structure'!A7","v":"Vote 6 - Energy Sources"},null,{"$f":"'C5C'!C62","v":0},{"$f":"'C5C'!D62","v":0},{"$f":"'C5C'!E62","v":0},{"$f":"'C5C'!F62","v":0},{"$f":"'C5C'!G62","v":0},{"$f":"'C5C'!H62","v":0},0,"",{"$f":"'C5C'!K62","v":0}]
[{"$f":"'Org structure'!A8","v":"Vote 7 - Road Transport"},null,{"$f":"'C5C'!C73","v":0},{"$f":"'C5C'!D73","v":0},{"$f":"'C5C'!E73","v":0},{"$f":"'C5C'!F73","v":0},{"$f":"'C5C'!G73","v":0},{"$f":"'C5C'!H73","v":0},0,"",{"$f":"'C5C'!K73","v":0}]
[{"$f":"'Org structure'!A9","v":"Vote 8 - Planning and Development"},null,{"$f":"'C5C'!C84","v":0},{"$f":"'C5C'!D84","v":0},{"$f":"'C5C'!E84","v":0},{"$f":"'C5C'!F84","v":0},{"$f":"'C5C'!G84","v":0},{"$f":"'C5C'!H84","v":0},0,"",{"$f":"'C5C'!K84","v":0}]
[{"$f":"'Org structure'!A10","v":"Vote 9 - Sport and Recreation"},null,{"$f":"'C5C'!C95","v":0},{"$f":"'C5C'!D95","v":0},{"$f":"'C5C'!E95","v":0},{"$f":"'C5C'!F95","v":0},{"$f":"'C5C'!G95","v":0},{"$f":"'C5C'!H95","v":0},0,"",{"$f":"'C5C'!K95","v":0}]
[{"$f":"'Org structure'!A11","v":"Vote 10 - Public Safety"},null,{"$f":"'C5C'!C106","v":0},{"$f":"'C5C'!D106","v":0},{"$f":"'C5C'!E106","v":0},{"$f":"'C5C'!F106","v":0},{"$f":"'C5C'!G106","v":0},{"$f":"'C5C'!H106","v":0},0,"",{"$f":"'C5C'!K106","v":0}]
[{"$f":"'Org structure'!A12","v":"Vote 11 - Other"},null,{"$f":"'C5C'!C117","v":0},{"$f":"'C5C'!D117","v":0},{"$f":"'C5C'!E117","v":0},{"$f":"'C5C'!F117","v":0},{"$f":"'C5C'!G117","v":0},{"$f":"'C5C'!H117","v":0},0,"",{"$f":"'C5C'!K117","v":0}]
[{"$f":"'Org structure'!A13","v":"Vote 12 - Waste Management"},null,{"$f":"'C5C'!C128","v":0},{"$f":"'C5C'!D128","v":0},{"$f":"'C5C'!E128","v":0},{"$f":"'C5C'!F128","v":0},{"$f":"'C5C'!G128","v":0},{"$f":"'C5C'!H128","v":0},0,"",{"$f":"'C5C'!K128","v":0}]
[{"$f":"'Org structure'!A14","v":"Vote 13 - Housing"},null,{"$f":"'C5C'!C139","v":0},{"$f":"'C5C'!D139","v":0},{"$f":"'C5C'!E139","v":0},{"$f":"'C5C'!F139","v":0},{"$f":"'C5C'!G139","v":0},{"$f":"'C5C'!H139","v":0},{"$f":"G18-H18","v":0},{"$f":"IF(I18=0,\"\",I18/H18)","v":""},{"$f":"'C5C'!K139","v":0}]
[{"$f":"'Org structure'!A15","v":"Vote 14 - Waste Water Management"},null,{"$f":"'C5C'!C150","v":0},{"$f":"'C5C'!D150","v":0},{"$f":"'C5C'!E150","v":0},{"$f":"'C5C'!F150","v":0},{"$f":"'C5C'!G150","v":0},{"$f":"'C5C'!H150","v":0},{"$f":"G19-H19","v":0},{"$f":"IF(I19=0,\"\",I19/H19)","v":""},{"$f":"'C5C'!K150","v":0}]
[{"$f":"'Org structure'!A16","v":"Vote 15 - Health"},null,{"$f":"'C5C'!C161","v":0},{"$f":"'C5C'!D161","v":0},{"$f":"'C5C'!E161","v":0},{"$f":"'C5C'!F161","v":0},{"$f":"'C5C'!G161","v":0},{"$f":"'C5C'!H161","v":0},{"$f":"G20-H20","v":0},{"$f":"IF(I20=0,\"\",I20/H20)","v":""},{"$f":"'C5C'!K161","v":0}]
["Total Capital Multi-year expenditure","4,7",{"$f":"SUM(C6:C20)","v":0},{"$f":"SUM(D6:D20)","v":0},0,0,0,0,0,{"$f":"IF(I21=0,\"\",I21/H21)","v":""},{"$f":"SUM(K6:K20)","v":0}]
[]
["Single Year expenditure appropriation",2]
[{"$f":"'Org structure'!A2","v":"Vote 1 - Finance and Administration"},null,{"$f":"'C5C'!C176","v":33565076},{"$f":"'C5C'!D176","v":6700000},{"$f":"'C5C'!E176","v":6700000},{"$f":"'C5C'!F176","v":1071196},{"$f":"'C5C'!G176","v":1239912},{"$f":"'C5C'!H176","v":3349998},{"$f":"'C5C'!I176","v":-2110086},{"$f":"IF(I24=0,\"\",I24/H24)","v":-0.62987679395629492},{"$f":"'C5C'!K176","v":6699999.9999999991}]
[{"$f":"'Org structure'!A3","v":"Vote 2 - Finance and Administration2"},null,{"$f":"'C5C'!C187","v":0},{"$f":"'C5C'!D187","v":0},{"$f":"'C5C'!E187","v":0},{"$f":"'C5C'!F187","v":0},{"$f":"'C5C'!G187","v":0},{"$f":"'C5C'!H187","v":0},{"$f":"'C5C'!I187","v":0},{"$f":"IF(I25=0,\"\",I25/H25)","v":""},{"$f":"'C5C'!K187","v":0}]
[{"$f":"'Org structure'!A4","v":"Vote 3 - Executive and Council"},null,{"$f":"'C5C'!C198","v":0},{"$f":"'C5C'!D198","v":0},{"$f":"'C5C'!E198","v":0},{"$f":"'C5C'!F198","v":0},{"$f":"'C5C'!G198","v":0},{"$f":"'C5C'!H198","v":0},{"$f":"'C5C'!I198","v":0},"",{"$f":"'C5C'!K198","v":0}]
[{"$f":"'Org structure'!A5","v":"Vote 4 - Community and Social Services"},null,{"$f":"'C5C'!C209","v":3033135},{"$f":"'C5C'!D209","v":1538516},{"$f":"'C5C'!E209","v":1538516},{"$f":"'C5C'!F209","v":0},{"$f":"'C5C'!G209","v":964853},{"$f":"'C5C'!H209","v":769260},{"$f":"'C5C'!I209","v":195593},0.25426123807295326,{"$f":"'C5C'!K209","v":1538515.6799999997}]
[{"$f":"'Org structure'!A6","v":"Vote 5 - Community and Social Services2"},null,{"$f":"'C5C'!C220","v":9953437},{"$f":"'C5C'!D220","v":7990468},{"$f":"'C5C'!E220","v":7990468},{"$f":"'C5C'!F220","v":289655},{"$f":"'C5C'!G220","v":2422166},{"$f":"'C5C'!H220","v":3995232},{"$f":"'C5C'!I220","v":-1573066},-0.39373583311307075,{"$f":"'C5C'!K220","v":7990466.9799999995}]
[{"$f":"'Org structure'!A7","v":"Vote 6 - Energy Sources"},null,{"$f":"'C5C'!C231","v":0},{"$f":"'C5C'!D231","v":0},{"$f":"'C5C'!E231","v":0},{"$f":"'C5C'!F231","v":0},{"$f":"'C5C'!G231","v":0},{"$f":"'C5C'!H231","v":0},{"$f":"'C5C'!I231","v":0},"",{"$f":"'C5C'!K231","v":0}]
[{"$f":"'Org structure'!A8","v":"Vote 7 - Road Transport"},null,{"$f":"'C5C'!C242","v":73517349},{"$f":"'C5C'!D242","v":9467783},{"$f":"'C5C'!E242","v":17191768},{"$f":"'C5C'!F242","v":2670098},{"$f":"'C5C'!G242","v":17502317},{"$f":"'C5C'!H242","v":7856016},{"$f":"'C5C'!I242","v":9646301},1.2278871377044038,{"$f":"'C5C'!K242","v":15712018}]
[{"$f":"'Org structure'!A9","v":"Vote 8 - Planning and Development"},null,{"$f":"'C5C'!C253","v":90719296},{"$f":"'C5C'!D253","v":0},{"$f":"'C5C'!E253","v":0},{"$f":"'C5C'!F253","v":0},{"$f":"'C5C'!G253","v":0},{"$f":"'C5C'!H253","v":0},{"$f":"'C5C'!I253","v":0},"",{"$f":"'C5C'!K253","v":0}]
[{"$f":"'Org structure'!A10","v":"Vote 9 - Sport and Recreation"},null,{"$f":"'C5C'!C264","v":0},{"$f":"'C5C'!D264","v":0},{"$f":"'C5C'!E264","v":0},{"$f":"'C5C'!F264","v":0},{"$f":"'C5C'!G264","v":0},{"$f":"'C5C'!H264","v":0},{"$f":"'C5C'!I264","v":0},"",{"$f":"'C5C'!K264","v":0}]
[{"$f":"'Org structure'!A11","v":"Vote 10 - Public Safety"},null,{"$f":"'C5C'!C275","v":0},{"$f":"'C5C'!D275","v":0},{"$f":"'C5C'!E275","v":0},{"$f":"'C5C'!F275","v":0},{"$f":"'C5C'!G275","v":0},{"$f":"'C5C'!H275","v":0},{"$f":"'C5C'!I275","v":0},"",{"$f":"'C5C'!K275","v":0}]
[{"$f":"'Org structure'!A12","v":"Vote 11 - Other"},null,{"$f":"'C5C'!C286","v":0},{"$f":"'C5C'!D286","v":0},{"$f":"'C5C'!E286","v":0},{"$f":"'C5C'!F286","v":0},{"$f":"'C5C'!G286","v":0},{"$f":"'C5C'!H286","v":0},{"$f":"'C5C'!I286","v":0},"",{"$f":"'C5C'!K286","v":0}]
[{"$f":"'Org structure'!A13","v":"Vote 12 - Waste Management"},null,{"$f":"'C5C'!C297","v":0},{"$f":"'C5C'!D297","v":0},{"$f":"'C5C'!E297","v":0},{"$f":"'C5C'!F297","v":0},{"$f":"'C5C'!G297","v":0},{"$f":"'C5C'!H297","v":0},{"$f":"'C5C'!I297","v":0},"",{"$f":"'C5C'!K297","v":0}]
[{"$f":"'Org structure'!A14","v":"Vote 13 - Housing"},null,{"$f":"'C5C'!C308","v":0},{"$f":"'C5C'!D308","v":0},{"$f":"'C5C'!E308","v":0},{"$f":"'C5C'!F308","v":0},{"$f":"'C5C'!G308","v":0},{"$f":"'C5C'!H308","v":0},{"$f":"'C5C'!I308","v":0},"",{"$f":"'C5C'!K308","v":0}]
[{"$f":"'Org structure'!A15","v":"Vote 14 - Waste Water Management"},null,{"$f":"'C5C'!C319","v":0},{"$f":"'C5C'!D319","v":0},{"$f":"'C5C'!E319","v":0},{"$f":"'C5C'!F319","v":0},{"$f":"'C5C'!G319","v":0},{"$f":"'C5C'!H319","v":0},{"$f":"'C5C'!I319","v":0},"",{"$f":"'C5C'!K319","v":0}]
[{"$f":"'Org structure'!A16","v":"Vote 15 - Health"},null,{"$f":"'C5C'!C330","v":0},{"$f":"'C5C'!D330","v":0},{"$f":"'C5C'!E330","v":0},{"$f":"'C5C'!F330","v":0},{"$f":"'C5C'!G330","v":0},{"$f":"'C5C'!H330","v":0},{"$f":"'C5C'!I330","v":0},"",{"$f":"'C5C'!K330","v":0}]
["Total Capital single-year expenditure",4,{"$f":"SUM(C24:C38)","v":210788293},25696767,33420752,4030949,22129248,15970506,6158742,0.38563223983009681,{"$f":"SUM(K24:K38)","v":31941000.659999996}]
["Total Capital Expenditure",null,{"$f":"C39+C21","v":210788293},25696767,33420752,4030949,22129248,15970506,6158742,{"$f":"IF(I40=0,\"\",I40/H40)","v":0.38563223983009681},{"$f":"K39+K21","v":31941000.659999996}]
[]
["Capital Expenditure - Functional Classification"]
["Governance and administration",null,{"$f":"SUM(C44:C46)","v":33565076},6700000,6700000,1071196,1239912,3349998,{"$f":"G43-H43","v":-2110086},{"$f":"IF(I43=0,\"\",I43/H43)","v":-0.62987679395629492},{"$f":"SUM(K44:K46)","v":6699999.9999999991}]
["Executive and council",null,0,0,0,0,0,0,0,{"$f":"IF(I44=0,\"\",I44/H44)","v":""},0]
["Finance and administration",null,33565076,6700000,6700000,1071196,1239912,3349998,-2110086,-0.62987679395629492,6699999.9999999991]
["Internal audit",null,0,0,0,0,0,0,0,"",0]
["Community and public safety",null,{"$f":"SUM(C48:C52)","v":12986572},9528984,9528984,289655,3387019,4764492,-1377473,-0.28911224953258396,{"$f":"SUM(K48:K52)","v":9528982.6600000001}]
["Community and social services",null,12986572,9528984,9528984,289655,3387019,4764492,-1377473,-0.28911224953258396,9528982.6600000001]
["Sport and recreation",null,0,0,0,0,0,0,0,"",0]
["Public safety",null,0,0,0,0,0,0,0,"",0]
["Housing",null,0,0,0,0,0,0,0,"",0]
["Health",null,0,0,0,0,0,0,0,"",0]
["Economic and environmental services",null,{"$f":"SUM(C54:C56)","v":170123651},9467783,17191768,2670098,17502317,7856016,9646301,1.2278871377044038,{"$f":"SUM(K54:K56)","v":15712032}]
["Planning and development",null,96606302,0,0,0,0,0,0,""]
["Road transport",null,73517349,9467783,17191768,2670098,17502317,7856016,9646301,1.2278871377044038,15712032]
["Environmental protection",null,0,0,0,0,0,0,0,""]
["Trading services",null,{"$f":"SUM(C58:C61)","v":0},0,0,0,0,0,0,"",{"$f":"SUM(K58:K61)","v":0}]
["Energy sources",null,null,null,null,null,null,null,0,""]
["Water management",null,null,null,null,null,null,null,0,""]
["Waste water management",null,null,null,null,null,null,null,0,""]
["Waste management",null,null,null,null,null,null,null,0,""]
["Other",null,null,null,null,null,null,null,0,""]
["Total Capital Expenditure - Functional Classification",3,{"$f":"C43+C47+C53+C57+C62","v":216675299},{"$f":"D43+D47+D53+D57+D62","v":25696767},33420752,4030949,22129248,15970506,6158742,0.38563223983009681,{"$f":"K43+K47+K53+K57+K62","v":31941014.66}]
[]
["Funded by:"]
["National Government",null,124282443,15996767,15996002,289655,9240502,7998000,{"$f":"G66-H66","v":1242502},{"$f":"IF(I66=0,\"\",I66/H66)","v":0.15535158789697423},15996000]
["Provincial Government",null,0,0,0,0,0,0,0,""]
["District Municipality",null,0,0,0,0,0,0,0,""]
[{"$f":"'C4-FinPerf RE'!A40","v":"Transfers and subsidies - capital (monetary allocations) (National / Provincial Departmental Agencies, Households, Non-profit Institutions, Private Enterprises, Public Corporatons, Higher Educational Institutions)"},null,0,0,0,0,0,0,0,""]
["Transfers recognised - capital",null,{"$f":"SUM(C66:C69)","v":124282443},15996767,15996002,289655,9240502,7998000,1242502,0.15535158789697423,{"$f":"SUM(K66:K69)","v":15996000}]
[]
["Borrowing",6,0,0,0,0,0,0,0,""]
["Internally generated funds",null,92392856,9700000,17424750,3741294,12888746,7972506,4916240,0.61664926937652975,15945012]
["Total Capital Funding",null,{"$f":"+C70+C72+C73","v":216675299},25696767,33420752,4030949,22129248,15970506,6158742,0.38563223983009681,{"$f":"+K70+K72+K73","v":31941012}]
[{"$f":"head27a","v":"References"}]
["1. Municipalities may choose to appropriate for capital expenditure for three years or for one year (if one year appropriation projected expenditure required for yr2 and yr3)."]
["2. Include capital component of PPP unitary payment"]
["3. Capital expenditure by functional classification must reconcile to the total of multi-year and single year appropriations"]
["4. Include expenditure on investment property, intangible and biological assets"]
[]
["6. Include finance leases and PPP capital funding component of unitary payment - total borrowing/repayments to reconcile to changes in Table SA17"]
[]
[]
[]
[]
["check balance",null,{"$f":"C40-C74","v":-5887006},{"$f":"D40-D74","v":0},0,0,0,0,null,null,-11.340000003576279]

{"sheet":"C5C","index":13,"n_rows":345,"n_cols":23,"rows_kept":345,"cut":false,"hidden":false,"merged":[[1,3,1,10],[1,11,1,22],[0,0,0,10]]}
[{"$f":"muni& \" - \"&S71D& \" - \"&\"A\"& \" - \"&date","v":"Choose name from list - Table C5 Monthly Budget Statement - Capital Expenditure (municipal vote, functional classification and funding) - A - Mid-Year Assessment"}]
[{"$f":"Vdesc","v":"Vote Description"},{"$f":"head27","v":"Ref"},{"$f":"Head1","v":"2019/20"},{"$f":"Head2","v":"Budget Year 2020/21"},null,null,null,null,null,null,null,{"$f":"Head4","v":{"$error":"#REF!"}}]
["R thousand",null,{"$f":"Head5","v":"Audited Outcome"},{"$f":"Head6","v":"Original Budget"},{"$f":"Head7","v":"Adjusted Budget"},{"$f":"Head38","v":"Monthly actual"},{"$f":"Head39","v":"YearTD actual"},{"$f":"Head40","v":"YearTD budget"},{"$f":"Head41","v":"YTD variance"},{"$f":"Head41","v":"YTD variance"},{"$f":"Head8","v":"Full Year Forecast"},{"$f":"Head12","v":"Forecast 2010/11"},{"$f":"Head13","v":"Forecast 2011/12"},{"$f":"Head14","v":"Forecast 2012/13"},{"$f":"Head15","v":"Forecast 2013/14"},{"$f":"Head16","v":"Forecast 2014/15"},{"$f":"Head17","v":"Forecast 2015/16"},{"$f":"Head18","v":"Forecast 2016/17"},{"$f":"Head19","v":"Forecast 2017/18"},{"$f":"Head20","v":"Forecast 2018/19"},{"$f":"Head21","v":"Forecast 2019/20"},{"$f":"Head22","v":"Forecast 2020/21"},{"$f":"Head23","v":"Forecast 2021/22"}]
[null,null,null,null,null,null,null,null,null,"%"]
["Capital expenditure - Municipal Vote"]
["Expenditure of multi-year capital appropriation",1]
[{"$f":"'Org structure'!A2","v":"Vote 1 - Finance and Administration"},null,{"$f":"SUM(C8:C17)","v":0},{"$f":"SUM(D8:D17)","v":0},0,0,0,0,{"$f":"G7-H7","v":0},{"$f":"IF(I7=0,\"\",I7/H7)","v":""},0]
[{"$f":"'Org structure'!E3","v":"1.1 - Finance"},null,null,null,null,null,null,null,0,""]
[{"$f":"'Org structure'!E4","v":"1.2 - Fleet Management"},null,null,null,null,null,null,null,0,""]
[{"$f":"'Org structure'!E5","v":"1.3 - Asset Management"},null,null,null,null,null,null,null,0,""]
[{"$f":"'Org structure'!E6","v":"1.4 - Administrative and Corporate Support"},null,null,null,null,null,null,null,0,""]
[{"$f":"'Org structure'!E7","v":"1.5 - Human Resources"},null,null,null,null,null,null,null,0,""]
[{"$f":"'Org structure'!E8","v":"1.6 - Property Services"},null,null,null,null,null,null,null,0,""]
[{"$f":"'Org structure'!E9","v":"1.7 - Legal Services"},null,null,null,null,null,null,null,0,""]
[{"$f":"'Org structure'!E10","v":"1.8 - Information Technology"},null,null,null,null,null,null,null,0,""]
[{"$f":"'Org structure'!E11","v":"1.9 - Marketing, Customer Relations, Publicity and Media Co-ordination"},null,null,null,null,null,null,null,0,""]
[{"$f":"'Org structure'!E12","v":"1.10 - Valuation Service"},null,null,null,null,null,null,null,0,""]
[{"$f":"'Org structure'!A3","v":"Vote 2 - Finance and Administration2"},null,{"$f":"SUM(C19:C28)","v":0},{"$f":"SUM(D19:D28)","v":0},0,0,0,0,0,"",0]
[{"$f":"'Org structure'!E14","v":"2.1 - Supply Chain Management"},null,null,null,null,null,null,null,0,""]
[{"$f":"'Org structure'!E15","v":0},null,null,null,null,null,null,null,0,""]
[{"$f":"'Org structure'!E16","v":0},null,null,null,null,null,null,null,0,""]
[{"$f":"'Org structure'!E17","v":0},null,null,null,null,null,null,null,0,""]
[{"$f":"'Org structure'!E18","v":0},null,null,null,null,null,null,null,0,""]
[{"$f":"'Org structure'!E19","v":0},null,null,null,null,null,null,null,0,""]
[{"$f":"'Org structure'!E20","v":0},null,null,null,null,null,null,null,0,""]
[{"$f":"'Org structure'!E21","v":0},null,null,null,null,null,null,null,0,""]
[{"$f":"'Org structure'!E22","v":0},null,null,null,null,null,null,null,0,""]
[{"$f":"'Org structure'!E23","v":0},null,null,null,null,null,null,null,0,""]
[{"$f":"'Org structure'!A4","v":"Vote 3 - Executive and Council"},null,{"$f":"SUM(C30:C39)","v":0},0,0,0,0,0,0,"",0]
[{"$f":"'Org structure'!E25","v":"3.1 - Municipal Manager, Town Secretary and Chief Executive"},null,null,null,null,null,null,null,0,""]
[{"$f":"'Org structure'!E26","v":"3.2 - Mayor and Council"},null,null,null,null,null,null,null,0,""]
[{"$f":"'Org structure'!E27","v":0},null,null,null,null,null,null,null,0,""]
[{"$f":"'Org structure'!E28","v":0},null,null,null,null,null,null,null,0,""]
[{"$f":"'Org structure'!E29","v":0},null,null,null,null,null,null,null,0,""]
[{"$f":"'Org structure'!E30","v":0},null,null,null,null,null,null,null,0,""]
[{"$f":"'Org structure'!E31","v":0},null,null,null,null,null,null,null,0,""]
[{"$f":"'Org structure'!E32","v":0},null,null,null,null,null,null,null,0,""]
[{"$f":"'Org structure'!E33","v":0},null,null,null,null,null,null,null,0,""]
[{"$f":"'Org structure'!E34","v":0},null,null,null,null,null,null,null,0,""]
[{"$f":"'Org structure'!A5","v":"Vote 4 - Community and Social Services"},null,{"$f":"SUM(C41:C50)","v":0},0,0,0,0,0,0,"",0]
[{"$f":"'Org structure'!E36","v":"4.1 - Disaster Management"},null,null,null,null,null,null,null,0,""]
[{"$f":"'Org structure'!E37","v":"4.2 - Libraries and Archives"},null,null,null,null,null,null,null,0,""]
[{"$f":"'Org structure'!E38","v":"4.3 - Population Development"},null,null,null,null,null,null,null,0,""]
[{"$f":"'Org structure'!E39","v":"4.4 - Cultural Matters"},null,null,null,null,null,null,null,0,""]
[{"$f":"'Org structure'!E40","v":"4.5 - Indigenous and Customary Law"},null,null,null,null,null,null,null,0,""]
[{"$f":"'Org structure'!E41","v":"4.6 - Industrial Promotion"},null,null,null,null,null,null,null,0,""]
[{"$f":"'Org structure'!E42","v":"4.7 - Agricultural"},null,null,null,null,null,null,null,0,""]
[{"$f":"'Org structure'!E43","v":"4.8 - Aged Care"},null,null,null,null,null,null,null,0,""]
[{"$f":"'Org structure'!E44","v":"4.9 - Child Care Facilities"},null,null,null,null,null,null,null,0,""]
[{"$f":"'Org structure'!E45","v":"4.10 - Animal Care and Diseases"},null,null,null,null,null,null,null,0,""]
[{"$f":"'Org structure'!A6","v":"Vote 5 - Community and Social Services2"},null,{"$f":"SUM(C52:C61)","v":0},{"$f":"SUM(D52:D61)","v":0},0,0,0,0,0,"",0]
[{"$f":"'Org structure'!E47","v":"5.1 - Literacy Programmes"},null,null,null,null,null,null,null,0,""]
[{"$f":"'Org structure'!E48","v":"5.2 - Education"},null,null,null,null,null,null,null,0,""]
[{"$f":"'Org structure'!E49","v":"5.3 - Community Halls and Facilities"},null,null,null,null,null,null,null,0,""]
[{"$f":"'Org structure'!E50","v":0},null,null,null,null,null,null,null,0,""]
[{"$f":"'Org structure'!E51","v":0},null,null,null,null,null,null,null,0,""]
[{"$f":"'Org structure'!E52","v":0},null,null,null,null,null,null,null,0,""]
[{"$f":"'Org structure'!E53","v":0},null,null,null,null,null,null,null,0,""]
[{"$f":"'Org structure'!E54","v":0},null,null,null,null,null,null,null,0,""]
[{"$f":"'Org structure'!E55","v":0},null,null,null,null,null,null,null,0,""]
[{"$f":"'Org structure'!E56","v":0},null,null,null,null,null,null,null,0,""]
[{"$f":"'Org structure'!A7","v":"Vote 6 - Energy Sources"},null,{"$f":"SUM(C63:C72)","v":0},{"$f":"SUM(D63:D72)","v":0},0,0,0,0,0,"",0]
[{"$f":"'Org structure'!E58","v":"6.1 - Electricity"},null,null,null,null,null,null,null,0,""]
[{"$f":"'Org structure'!E59","v":0},null,null,null,null,null,null,null,0,""]
[{"$f":"'Org structure'!E60","v":0},null,null,null,null,null,null,null,0,""]
[{"$f":"'Org structure'!E61","v":0},null,null,null,null,null,null,null,0,""]
[{"$f":"'Org structure'!E62","v":0},null,null,null,null,null,null,null,0,""]
[{"$f":"'Org structure'!E63","v":0},null,null,null,null,null,null,null,0,""]
[{"$f":"'Org structure'!E64","v":0},null,null,null,null,null,null,null,0,""]
[{"$f":"'Org structure'!E65","v":0},null,null,null,null,null,null,null,0,""]
[{"$f":"'Org structure'!E66","v":0},null,null,null,null,null,null,null,{"$f":"G71-H71","v":0},{"$f":"IF(I71=0,\"\",I71/H71)","v":""}]
[{"$f":"'Org structure'!E67","v":0},null,null,null,null,null,null,null,0,""]
[{"$f":"'Org structure'!A8","v":"Vote 7 - Road Transport"},null,{"$f":"SUM(C74:C83)","v":0},0,0,0,0,0,0,"",0]
[{"$f":"'Org structure'!E69","v":"7.1 - Roads"},null,null,null,null,null,null,null,0,""]
[{"$f":"'Org structure'!E70","v":0},null,null,null,null,null,null,null,0,""]
[{"$f":"'Org structure'!E71","v":0},null,null,null,null,null,null,null,0,""]
[{"$f":"'Org structure'!E72","v":0},null,null,null,null,null,null,null,0,""]
[{"$f":"'Org structure'!E73","v":0},null,null,null,null,null,null,null,0,""]
[{"$f":"'Org structure'!E74","v":0},null,null,null,null,null,null,null,0,""]
[{"$f":"'Org structure'!E75","v":0},null,null,null,null,null,null,null,0,""]
[{"$f":"'Org structure'!E76","v":0},null,null,null,null,null,null,null,0,""]
[{"$f":"'Org structure'!E77","v":0},null,null,null,null,null,null,null,0,""]
[{"$f":"'Org structure'!E78","v":0},null,null,null,null,null,null,null,0,""]
[{"$f":"'Org structure'!A9","v":"Vote 8 - Planning and Development"},null,{"$f":"SUM(C85:C94)","v":0},{"$f":"SUM(D85:D94)","v":0},0,0,0,0,0,"",0]
[{"$f":"'Org structure'!E80","v":"8.1 - Town Planning, Building Regulations and Enforcement, and City Engineer"},null,null,null,null,null,null,null,0,""]
[{"$f":"'Org structure'!E81","v":"8.2 - Development Facilitation"},null,null,null,null,null,null,null,0,""]
[{"$f":"'Org structure'!E82","v":"8.3 - Economic Development/Planning"},null,null,null,null,null,null,null,0,""]
[{"$f":"'Org structure'!E83","v":"8.4 - Regional Planning and Development"},null,null,null,null,null,null,null,0,""]
[{"$f":"'Org structure'!E84","v":"8.5 - Corporate Wide Strategic Planning (IDPs, LEDs)"},null,null,null,null,null,null,null,0,""]
[{"$f":"'Org structure'!E85","v":"8.6 - Project Management Unit"},null,null,null,null,null,null,null,0,""]
[{"$f":"'Org structure'!E86","v":0},null,null,null,null,null,null,null,0,""]
[{"$f":"'Org structure'!E87","v":0},null,null,null,null,null,null,null,0,""]
[{"$f":"'Org structure'!E88","v":0},null,null,null,null,null,null,null,0,""]
[{"$f":"'Org structure'!E89","v":0},null,null,null,null,null,null,null,0,""]
[{"$f":"'Org structure'!A10","v":"Vote 9 - Sport and Recreation"},null,{"$f":"SUM(C96:C105)","v":0},{"$f":"SUM(D96:D105)","v":0},0,0,0,0,0,"",0]
[{"$f":"'Org structure'!E91","v":"9.1 - Sports Grounds and Stadiums"},null,null,null,null,null,null,null,0,""]
[{"$f":"'Org structure'!E92","v":0},null,null,null,null,null,null,null,0,""]
[{"$f":"'Org structure'!E93","v":0},null,null,null,null,null,null,null,0,""]
[{"$f":"'Org structure'!E94","v":0},null,null,null,null,null,null,null,0,""]
[{"$f":"'Org structure'!E95","v":0},null,null,null,null,null,null,null,0,""]
[{"$f":"'Org structure'!E96","v":0},null,null,null,null,null,null,null,0,""]
[{"$f":"'Org structure'!E97","v":0},null,null,null,null,null,null,null,0,""]
[{"$f":"'Org structure'!E98","v":0},null,null,null,null,null,null,null,0,""]
[{"$f":"'Org structure'!E99","v":0},null,null,null,null,null,null,null,0,""]
[{"$f":"'Org structure'!E100","v":0},null,null,null,null,null,null,null,0,""]
[{"$f":"'Org structure'!A11","v":"Vote 10 - Public Safety"},null,{"$f":"SUM(C107:C116)","v":0},{"$f":"SUM(D107:D116)","v":0},0,0,0,0,0,"",0]
[{"$f":"'Org structure'!E102","v":"10.1 - Fire Fighting and Protection"},null,null,null,null,null,null,null,0,""]
[{"$f":"'Org structure'!E103","v":"10.2 - Fencing and Fences"},null,null,null,null,null,null,null,0,""]
[{"$f":"'Org structure'!E104","v":0},null,null,null,null,null,null,null,0,""]
[{"$f":"'Org structure'!E105","v":0},null,null,null,null,null,null,null,0,""]
[{"$f":"'Org structure'!E106","v":0},null,null,null,null,null,null,null,0,""]
[{"$f":"'Org structure'!E107","v":0},null,null,null,null,null,null,null,0,""]
[{"$f":"'Org structure'!E108","v":0},null,null,null,null,null,null,null,0,""]
[{"$f":"'Org structure'!E109","v":0},null,null,null,null,null,null,null,0,""]
[{"$f":"'Org structure'!E110","v":0},null,null,null,null,null,null,null,0,""]
[{"$f":"'Org structure'!E111","v":0},null,null,null,null,null,null,null,0,""]
[{"$f":"'Org structure'!A12","v":"Vote 11 - Other"},null,{"$f":"SUM(C118:C127)","v":0},{"$f":"SUM(D118:D127)","v":0},0,0,0,0,0,"",0]
[{"$f":"'Org structure'!E113","v":"11.1 - Licensing and Regulation"},null,null,null,null,null,null,null,0,""]
[{"$f":"'Org structure'!E114","v":0},null,null,null,null,null,null,null,0,""]
[{"$f":"'Org structure'!E115","v":0},null,null,null,null,null,null,null,0,""]
[{"$f":"'Org structure'!E116","v":0},null,null,null,null,null,null,null,0,""]
[{"$f":"'Org structure'!E117","v":0},null,null,null,null,null,null,null,0,""]
[{"$f":"'Org structure'!E118","v":0},null,null,null,null,null,null,null,0,""]
[{"$f":"'Org structure'!E119","v":0},null,null,null,null,null,null,null,0,""]
[{"$f":"'Org structure'!E120","v":0},null,null,null,null,null,null,null,0,""]
[{"$f":"'Org structure'!E121","v":0},null,null,null,null,null,null,null,0,""]
[{"$f":"'Org structure'!E122","v":0},null,null,null,null,null,null,null,0,""]
[{"$f":"'Org structure'!A13","v":"Vote 12 - Waste Management"},null,{"$f":"SUM(C129:C138)","v":0},{"$f":"SUM(D129:D138)","v":0},0,0,0,0,0,"",0]
[{"$f":"'Org structure'!E124","v":"12.1 - Solid Waste Removal"},null,null,null,null,null,null,null,0,""]
[{"$f":"'Org structure'!E125","v":"12.2 - Street Cleaning"},null,null,null,null,null,null,null,0,""]
[{"$f":"'Org structure'!E126","v":"12.3 - Solid Waste Disposal (Landfill Sites)"},null,null,null,null,null,null,null,0,""]
[{"$f":"'Org structure'!E127","v":0},null,null,null,null,null,null,null,0,""]
[{"$f":"'Org structure'!E128","v":0},null,null,null,null,null,null,null,0,""]
[{"$f":"'Org structure'!E129","v":0},null,null,null,null,null,null,null,0,""]
[{"$f":"'Org structure'!E130","v":0},null,null,null,null,null,null,null,{"$f":"G135-H135","v":0},{"$f":"IF(I135=0,\"\",I135/H135)","v":""}]
[{"$f":"'Org structure'!E131","v":0},null,null,null,null,null,null,null,0,""]
[{"$f":"'Org structure'!E132","v":0},null,null,null,null,null,null,null,0,""]
[{"$f":"'Org structure'!E133","v":0},null,null,null,null,null,null,null,0,""]
[{"$f":"'Org structure'!A14","v":"Vote 13 - Housing"},null,{"$f":"SUM(C140:C149)","v":0},{"$f":"SUM(D140:D149)","v":0},0,0,0,0,0,"",0]
[{"$f":"'Org structure'!E135","v":"13.1 - Housing"},null,null,null,null,null,null,null,0,""]
[{"$f":"'Org structure'!E136","v":0},null,null,null,null,null,null,null,0,""]
[{"$f":"'Org structure'!E137","v":0},null,null,null,null,null,null,null,0,""]
[{"$f":"'Org structure'!E138","v":0},null,null,null,null,null,null,null,0,""]
[{"$f":"'Org structure'!E139","v":0},null,null,null,null,null,null,null,0,""]
[{"$f":"'Org structure'!E140","v":0},null,null,null,null,null,null,null,0,""]
[{"$f":"'Org structure'!E141","v":0},null,null,null,null,null,null,null,0,""]
[{"$f":"'Org structure'!E142","v":0},null,null,null,null,null,null,null,0,""]
[{"$f":"'Org structure'!E143","v":0},null,null,null,null,null,null,null,0,""]
[{"$f":"'Org structure'!E144","v":0},null,null,null,null,null,null,null,0,""]
[{"$f":"'Org structure'!A15","v":"Vote 14 - Waste Water Management"},null,{"$f":"SUM(C151:C160)","v":0},{"$f":"SUM(D151:D160)","v":0},0,0,0,0,0,"",0]
[{"$f":"'Org structure'!E146","v":"14.1 - Storm Water Management"},null,null,null,null,null,null,null,0,""]
[{"$f":"'Org structure'!E147","v":0},null,null,null,null,null,null,null,0,""]
[{"$f":"'Org structure'!E148","v":0},null,null,null,null,null,null,null,0,""]
[{"$f":"'Org structure'!E149","v":0},null,null,null,null,null,null,null,0,""]
[{"$f":"'Org structure'!E150","v":0},null,null,null,null,null,null,null,0,""]
[{"$f":"'Org structure'!E151","v":0},null,null,null,null,null,null,null,0,""]
[{"$f":"'Org structure'!E152","v":0},null,null,null,null,null,null,null,0,""]
[{"$f":"'Org structure'!E153","v":0},null,null,null,null,null,null,null,0,""]
[{"$f":"'Org structure'!E154","v":0},null,null,null,null,null,null,null,0,""]
[{"$f":"'Org structure'!E155","v":0},null,null,null,null,null,null,null,0,""]
[{"$f":"'Org structure'!A16","v":"Vote 15 - Health"},null,{"$f":"SUM(C162:C171)","v":0},{"$f":"SUM(D162:D171)","v":0},0,0,0,0,0,"",0]
[{"$f":"'Org structure'!E157","v":"15.1 - Health Services"},null,null,null,null,null,null,null,0,""]
[{"$f":"'Org structure'!E158","v":"15.2 - Tourism"},null,null,null,null,null,null,null,0,""]
[{"$f":"'Org structure'!E159","v":0},null,null,null,null,null,null,null,0,""]
[{"$f":"'Org structure'!E160","v":0},null,null,null,null,null,null,null,0,""]
[{"$f":"'Org structure'!E161","v":0},null,null,null,null,null,null,null,0,""]
[{"$f":"'Org structure'!E162","v":0},null,null,null,null,null,null,null,0,""]
[{"$f":"'Org structure'!E163","v":0},null,null,null,null,null,null,null,0,""]
[{"$f":"'Org structure'!E164","v":0},null,null,null,null,null,null,null,0,""]
[{"$f":"'Org structure'!E165","v":0},null,null,null,null,null,null,null,0,""]
[{"$f":"'Org structure'!E166","v":0},null,null,null,null,null,null,null,0,"",null,{"$f":"SUM(L79:L82)","v":0},0,0,0,0,0,0,0,0,0,0,0]
["Total multi-year capital expenditure",null,{"$f":"C7+C18+C29+C40+C51+C62+C73+C84+C95+C106+C117+C128+C139+C150+C161","v":0},{"$f":"D7+D18+D29+D40+D51+D62+D73+D84+D95+D106+D117+D128+D139+D150+D161","v":0},0,0,0,0,0,"",0]
[null,null,null,null,null,null,null,null,0,""]
["Capital expenditure - Municipal Vote"]
["Expenditue of single-year capital appropriation",1,null,null,null,null,null,null,0,""]
["Vote 1 - Finance and Administration",null,{"$f":"SUM(C177:C186)","v":33565076},6700000,6700000,1071196,1239912,3349998,-2110086,-0.62987679395629492,6699999.9999999991]
[{"$f":"'Org structure'!E3","v":"1.1 - Finance"},null,472275,5000000,5000000,1022301,1022301,2500002,-1477701,-0.59107992713605828,4999999.9999999991]
[{"$f":"'Org structure'!E4","v":"1.2 - Fleet Management"},null,2845481,0,0,0,0,0,0,"",0]
[{"$f":"'Org structure'!E5","v":"1.3 - Asset Management"},null,30247320,300000,300000,0,92826,150000,-57174,-0.38116,300000]
[{"$f":"'Org structure'!E6","v":"1.4 - Administrative and Corporate Support"},null,0,1400000,1400000,48895,124785,699996,-575211,-0.8217346956268321,1400000]
[{"$f":"'Org structure'!E7","v":"1.5 - Human Resources"},null,0,0,0,0,0,0,0,"",0]
[{"$f":"'Org structure'!E8","v":"1.6 - Property Services"},null,0,0,0,0,0,0,0,"",0]
[{"$f":"'Org structure'!E9","v":"1.7 - Legal Services"},null,0,0,0,0,0,0,0,"",0]
[{"$f":"'Org structure'!E10","v":"1.8 - Information Technology"},null,0,0,0,0,0,0,0,"",0]
[{"$f":"'Org structure'!E11","v":"1.9 - Marketing, Customer Relations, Publicity and Media Co-ordination"},null,0,0,0,0,0,0,0,"",0]
[{"$f":"'Org structure'!E12","v":"1.10 - Valuation Service"},null,0,0,0,0,0,0,0,"",0]
["Vote 2 - Finance and Administration2",null,{"$f":"SUM(C188:C197)","v":0},{"$f":"SUM(D188:D197)","v":0},{"$f":"SUM(E188:E197)","v":0},0,0,0,0,"",0]
[{"$f":"'Org structure'!E14","v":"2.1 - Supply Chain Management"},null,null,null,null,null,null,null,0,""]
[{"$f":"'Org structure'!E15","v":0},null,null,null,null,null,null,null,0,""]
[{"$f":"'Org structure'!E16","v":0},null,null,null,null,null,null,null,0,""]
[{"$f":"'Org structure'!E17","v":0},null,null,null,null,null,null,null,0,""]
[{"$f":"'Org structure'!E18","v":0},null,null,null,null,null,null,null,0,""]
[{"$f":"'Org structure'!E19","v":0},null,null,null,null,null,null,null,0,""]
[{"$f":"'Org structure'!E20","v":0},null,null,null,null,null,null,null,0,""]
[{"$f":"'Org structure'!E21","v":0},null,null,null,null,null,null,null,0,""]
[{"$f":"'Org structure'!E22","v":0},null,null,null,null,null,null,null,0,""]
[{"$f":"'Org structure'!E23","v":0},null,null,null,null,null,null,null,0,""]
["Vote 3 - Executive and Council",null,{"$f":"SUM(C199:C208)","v":0},0,0,0,0,0,0,"",0]
[{"$f":"'Org structure'!E25","v":"3.1 - Municipal Manager, Town Secretary and Chief Executive"},null,null,null,null,null,null,null,0,""]
[{"$f":"'Org structure'!E26","v":"3.2 - Mayor and Council"},null,null,null,null,null,null,null,{"$f":"G200-H200","v":0},{"$f":"IF(I200=0,\"\",I200/H200)","v":""}]
[{"$f":"'Org structure'!E27","v":0},null,null,null,null,null,null,null,0,""]
[{"$f":"'Org structure'!E28","v":0},null,null,null,null,null,null,null,0,""]
[{"$f":"'Org structure'!E29","v":0},null,null,null,null,null,null,null,0,""]
[{"$f":"'Org structure'!E30","v":0},null,null,null,null,null,null,null,0,""]
[{"$f":"'Org structure'!E31","v":0},null,null,null,null,null,null,null,0,""]
[{"$f":"'Org structure'!E32","v":0},null,null,null,null,null,null,null,0,""]
[{"$f":"'Org structure'!E33","v":0},null,null,null,null,null,null,null,0,""]
[{"$f":"'Org structure'!E34","v":0},null,null,null,null,null,null,null,0,""]
["Vote 4 - Community and Social Services",null,{"$f":"SUM(C210:C219)","v":3033135},1538516,1538516,0,964853,769260,195593,0.25426123807295326,1538515.6799999997]
[{"$f":"'Org structure'!E36","v":"4.1 - Disaster Management"},null,0,0,0,0,0,0,0,""]
[{"$f":"'Org structure'!E37","v":"4.2 - Libraries and Archives"},null,0,0,0,0,0,0,0,""]
[{"$f":"'Org structure'!E38","v":"4.3 - Population Development"},null,0,0,0,0,0,0,0,""]
[{"$f":"'Org structure'!E39","v":"4.4 - Cultural Matters"},null,0,0,0,0,0,0,0,""]
[{"$f":"'Org structure'!E40","v":"4.5 - Indigenous and Customary Law"},null,0,0,0,0,0,0,0,""]
[{"$f":"'Org structure'!E41","v":"4.6 - Industrial Promotion"},null,0,0,0,0,0,0,0,""]
[{"$f":"'Org structure'!E42","v":"4.7 - Agricultural"},null,0,0,0,0,0,0,0,""]
[{"$f":"'Org structure'!E43","v":"4.8 - Aged Care"},null,0,0,0,0,0,0,0,""]
[{"$f":"'Org structure'!E44","v":"4.9 - Child Care Facilities"},null,3033135,1538516,1538516,0,964853,769260,195593,0.25426123807295326,1538515.6799999997]
[{"$f":"'Org structure'!E45","v":"4.10 - Animal Care and Diseases"},null,0,0,0,0,0,0,0,""]
["Vote 5 - Community and Social Services2",null,{"$f":"SUM(C221:C230)","v":9953437},7990468,7990468,289655,2422166,3995232,-1573066,-0.39373583311307075,7990466.9799999995]
[{"$f":"'Org structure'!E47","v":"5.1 - Literacy Programmes"},null,0,0,0,0,0,0,0,"",0]
[{"$f":"'Org structure'!E48","v":"5.2 - Education"},null,0,0,0,0,0,0,0,"",0]
[{"$f":"'Org structure'!E49","v":"5.3 - Community Halls and Facilities"},null,9953437,7990468,7990468,289655,2422166,3995232,-1573066,-0.39373583311307075,7990466.9799999995]
[{"$f":"'Org structure'!E50","v":0},null,0,0,0,0,0,0,0,"",0]
[{"$f":"'Org structure'!E51","v":0},null,0,0,0,0,0,0,0,"",0]
[{"$f":"'Org structure'!E52","v":0},null,0,0,0,0,0,0,0,"",0]
[{"$f":"'Org structure'!E53","v":0},null,0,0,0,0,0,0,0,"",0]
[{"$f":"'Org structure'!E54","v":0},null,0,0,0,0,0,0,0,"",0]
[{"$f":"'Org structure'!E55","v":0},null,0,0,0,0,0,0,0,"",0]
[{"$f":"'Org structure'!E56","v":0},null,0,0,0,0,0,0,0,"",0]
["Vote 6 - Energy Sources",null,{"$f":"SUM(C232:C241)","v":0},0,0,0,0,0,0,"",0]
[{"$f":"'Org structure'!E58","v":"6.1 - Electricity"},null,null,null,0,null,null,null,0,""]
[{"$f":"'Org structure'!E59","v":0},null,0,0,0,0,0,0,0,""]
[{"$f":"'Org structure'!E60","v":0},null,0,0,0,0,0,0,0,""]
[{"$f":"'Org structure'!E61","v":0},null,0,0,0,0,0,0,0,""]
[{"$f":"'Org structure'!E62","v":0},null,0,0,0,0,0,0,0,""]
[{"$f":"'Org structure'!E63","v":0},null,0,0,0,0,0,0,0,""]
[{"$f":"'Org structure'!E64","v":0},null,0,0,0,0,0,0,0,""]
[{"$f":"'Org structure'!E65","v":0},null,0,0,0,0,0,0,0,""]
[{"$f":"'Org structure'!E66","v":0},null,0,0,0,0,0,0,0,""]
[{"$f":"'Org structure'!E67","v":0},null,0,0,0,0,0,0,0,""]
["Vote 7 - Road Transport",null,{"$f":"SUM(C243:C252)","v":73517349},9467783,17191768,2670098,17502317,7856016,9646301,1.2278871377044038,15712018]
[{"$f":"'Org structure'!E69","v":"7.1 - Roads"},null,73517349,9467783,17191768,2670098,17502317,7856016,9646301,1.2278871377044038,15712018]
[{"$f":"'Org structure'!E70","v":0},null,0,0,0,0,0,0,0,""]
[{"$f":"'Org structure'!E71","v":0},null,0,0,0,0,0,0,0,""]
[{"$f":"'Org structure'!E72","v":0},null,0,0,0,0,0,0,0,""]
[{"$f":"'Org structure'!E73","v":0},null,0,0,0,0,0,0,0,""]
[{"$f":"'Org structure'!E74","v":0},null,0,0,0,0,0,0,0,""]
[{"$f":"'Org structure'!E75","v":0},null,0,0,0,0,0,0,0,""]
[{"$f":"'Org structure'!E76","v":0},null,0,0,0,0,0,0,0,""]
[{"$f":"'Org structure'!E77","v":0},null,0,0,0,0,0,0,0,""]
[{"$f":"'Org structure'!E78","v":0},null,0,0,0,0,0,0,0,""]
["Vote 8 - Planning and Development",null,{"$f":"SUM(C254:C263)","v":90719296},0,0,0,0,0,0,"",0]
[{"$f":"'Org structure'!E80","v":"8.1 - Town Planning, Building Regulations and Enforcement, and City Engineer"},null,90719296,0,0,0,0,0,0,""]
[{"$f":"'Org structure'!E81","v":"8.2 - Development Facilitation"},null,0,0,0,0,0,0,0,""]
[{"$f":"'Org structure'!E82","v":"8.3 - Economic Development/Planning"},null,0,0,0,0,0,0,0,""]
[{"$f":"'Org structure'!E83","v":"8.4 - Regional Planning and Development"},null,0,0,0,0,0,0,0,""]
[{"$f":"'Org structure'!E84","v":"8.5 - Corporate Wide Strategic Planning (IDPs, LEDs)"},null,0,0,0,0,0,0,0,""]
[{"$f":"'Org structure'!E85","v":"8.6 - Project Management Unit"},null,0,0,0,0,0,0,0,""]
[{"$f":"'Org structure'!E86","v":0},null,0,0,0,0,0,0,0,""]
[{"$f":"'Org structure'!E87","v":0},null,0,0,0,0,0,0,0,""]
[{"$f":"'Org structure'!E88","v":0},null,0,0,0,0,0,0,0,""]
[{"$f":"'Org structure'!E89","v":0},null,0,0,0,0,0,0,0,""]
["Vote 9 - Sport and Recreation",null,{"$f":"SUM(C265:C274)","v":0},0,0,0,0,0,{"$f":"G264-H264","v":0},{"$f":"IF(I264=0,\"\",I264/H264)","v":""},0]
[{"$f":"'Org structure'!E91","v":"9.1 - Sports Grounds and Stadiums"},null,null,null,null,null,null,null,0,""]
[{"$f":"'Org structure'!E92","v":0},null,null,null,null,null,null,null,0,""]
[{"$f":"'Org structure'!E93","v":0},null,null,null,null,null,null,null,0,""]
[{"$f":"'Org structure'!E94","v":0},null,null,null,null,null,null,null,0,""]
[{"$f":"'Org structure'!E95","v":0},null,null,null,null,null,null,null,0,""]
[{"$f":"'Org structure'!E96","v":0},null,null,null,null,null,null,null,0,""]
[{"$f":"'Org structure'!E97","v":0},null,null,null,null,null,null,null,0,""]
[{"$f":"'Org structure'!E98","v":0},null,null,null,null,null,null,null,0,""]
[{"$f":"'Org structure'!E99","v":0},null,null,null,null,null,null,null,0,""]
[{"$f":"'Org structure'!E100","v":0},null,null,null,null,null,null,null,0,""]
["Vote 11 - Other",null,{"$f":"SUM(C276:C285)","v":0},0,0,0,0,0,0,"",0]
[{"$f":"'Org structure'!E102","v":"10.1 - Fire Fighting and Protection"},null,null,null,null,null,null,null,0,""]
[{"$f":"'Org structure'!E103","v":"10.2 - Fencing and Fences"},null,null,null,null,null,null,null,0,""]
[{"$f":"'Org structure'!E104","v":0},null,null,null,null,null,null,null,0,""]
[{"$f":"'Org structure'!E105","v":0},null,null,null,null,null,null,null,0,""]
[{"$f":"'Org structure'!E106","v":0},null,null,null,null,null,null,null,0,""]
[{"$f":"'Org structure'!E107","v":0},null,null,null,null,null,null,null,0,""]
[{"$f":"'Org structure'!E108","v":0},null,null,null,null,null,null,null,0,""]
[{"$f":"'Org structure'!E109","v":0},null,null,null,null,null,null,null,0,""]
[{"$f":"'Org structure'!E110","v":0},null,null,null,null,null,null,null,0,""]
[{"$f":"'Org structure'!E111","v":0},null,null,null,null,null,null,null,0,""]
["Vote 12 - Waste Management",null,{"$f":"SUM(C287:C296)","v":0},0,0,0,0,0,0,"",0]
[{"$f":"'Org structure'!E113","v":"11.1 - Licensing and Regulation"},null,null,null,null,null,null,null,0,""]
[{"$f":"'Org structure'!E114","v":0},null,null,null,null,null,null,null,0,""]
[{"$f":"'Org structure'!E115","v":0},null,null,null,null,null,null,null,0,""]
[{"$f":"'Org structure'!E116","v":0},null,null,null,null,null,null,null,0,""]
[{"$f":"'Org structure'!E117","v":0},null,null,null,null,null,null,null,0,""]
[{"$f":"'Org structure'!E118","v":0},null,null,null,null,null,null,null,0,""]
[{"$f":"'Org structure'!E119","v":0},null,null,null,null,null,null,null,0,""]
[{"$f":"'Org structure'!E120","v":0},null,null,null,null,null,null,null,0,""]
[{"$f":"'Org structure'!E121","v":0},null,null,null,null,null,null,null,0,""]
[{"$f":"'Org structure'!E122","v":0},null,null,null,null,null,null,null,0,""]
["Vote 13 - Housing",null,{"$f":"SUM(C298:C307)","v":0},0,0,0,0,0,0,"",0]
[{"$f":"'Org structure'!E124","v":"12.1 - Solid Waste Removal"},null,null,null,null,null,null,null,0,""]
[{"$f":"'Org structure'!E125","v":"12.2 - Street Cleaning"},null,null,null,null,null,null,null,0,""]
[{"$f":"'Org structure'!E126","v":"12.3 - Solid Waste Disposal (Landfill Sites)"},null,null,null,null,null,null,null,0,""]
[{"$f":"'Org structure'!E127","v":0},null,null,null,null,null,null,null,0,""]
[{"$f":"'Org structure'!E128","v":0},null,null,null,null,null,null,null,0,""]
[{"$f":"'Org structure'!E129","v":0},null,null,null,null,null,null,null,0,""]
[{"$f":"'Org structure'!E130","v":0},null,null,null,null,null,null,null,0,""]
[{"$f":"'Org structure'!E131","v":0},null,null,null,null,null,null,null,0,""]
[{"$f":"'Org structure'!E132","v":0},null,null,null,null,null,null,null,0,""]
[{"$f":"'Org structure'!E133","v":0},null,null,null,null,null,null,null,0,""]
["Vote 14 - Waste Water Management",null,{"$f":"SUM(C309:C318)","v":0},0,0,0,0,0,0,"",0]
[{"$f":"'Org structure'!E135","v":"13.1 - Housing"},null,null,null,null,null,null,null,0,""]
[{"$f":"'Org structure'!E136","v":0},null,null,null,null,null,null,null,0,""]
[{"$f":"'Org structure'!E137","v":0},null,null,null,null,null,null,null,0,""]
[{"$f":"'Org structure'!E138","v":0},null,null,null,null,null,null,null,0,""]
[{"$f":"'Org structure'!E139","v":0},null,null,null,null,null,null,null,0,""]
[{"$f":"'Org structure'!E140","v":0},null,null,null,null,null,null,null,0,""]
[{"$f":"'Org structure'!E141","v":0},null,null,null,null,null,null,null,0,""]
[{"$f":"'Org structure'!E142","v":0},null,null,null,null,null,null,null,0,""]
[{"$f":"'Org structure'!E143","v":0},null,null,null,null,null,null,null,0,""]
[{"$f":"'Org structure'!E144","v":0},null,null,null,null,null,null,null,0,""]
["Vote 15 - Health",null,{"$f":"SUM(C320:C329)","v":0},0,0,0,0,0,0,"",0]
[{"$f":"'Org structure'!E146","v":"14.1 - Storm Water Management"},null,null,null,null,null,null,null,0,""]
[{"$f":"'Org structure'!E147","v":0},null,null,null,null,null,null,null,0,""]
[{"$f":"'Org structure'!E148","v":0},null,null,null,null,null,null,null,0,""]
[{"$f":"'Org structure'!E149","v":0},null,null,null,null,null,null,null,0,""]
[{"$f":"'Org structure'!E150","v":0},null,null,null,null,null,null,null,0,""]
[{"$f":"'Org structure'!E151","v":0},null,null,null,null,null,null,null,0,""]
[{"$f":"'Org structure'!E152","v":0},null,null,null,null,null,null,null,0,""]
[{"$f":"'Org structure'!E153","v":0},null,null,null,null,null,null,null,0,""]
[{"$f":"'Org structure'!E154","v":0},null,null,null,null,null,null,null,{"$f":"G328-H328","v":0},{"$f":"IF(I328=0,\"\",I328/H328)","v":""}]
[{"$f":"'Org structure'!E155","v":0},null,null,null,null,null,null,null,0,""]
[{"$f":"'Org structure'!A16","v":"Vote 15 - Health"},null,{"$f":"SUM(C331:C340)","v":0},0,0,0,0,0,0,"",0]
[{"$f":"'Org structure'!E157","v":"15.1 - Health Services"},null,null,null,null,null,null,null,0,""]
[{"$f":"'Org structure'!E158","v":"15.2 - Tourism"},null,null,null,null,null,null,null,0,""]
[{"$f":"'Org structure'!E159","v":0},null,null,null,null,null,null,null,0,""]
[{"$f":"'Org structure'!E160","v":0},null,null,null,null,null,null,null,0,""]
[{"$f":"'Org structure'!E161","v":0},null,null,null,null,null,null,null,0,""]
[{"$f":"'Org structure'!E162","v":0},null,null,null,null,null,null,null,0,""]
[{"$f":"'Org structure'!E163","v":0},null,null,null,null,null,null,null,0,""]
[{"$f":"'Org structure'!E164","v":0},null,null,null,null,null,null,null,0,""]
[{"$f":"'Org structure'!E165","v":0},null,null,null,null,null,null,null,0,""]
[{"$f":"'Org structure'!E166","v":0},null,null,null,null,null,null,null,0,"",null,{"$f":"SUM(L175:L251)","v":0},0,0,0,0,0,0,0,0,0,0,0]
["Total single-year capital expenditure",null,{"$f":"C176+C187+C198+C209+C220+C231+C242+C253+C264+C286+C297+C308+C319+C330+C275","v":210788293},{"$f":"D176+D187+D198+D209+D220+D231+D242+D253+D264+D286+D297+D308+D319+D330+D275","v":25696767},33420752,4030949,22129248,15970506,6158742,0.38563223983009681,31941000.659999996]
[null,null,null,null,null,null,null,null,0,"",null,{"$f":"L171-L340","v":0},0,0,0,0,0,0,0,0,0,0,0]
["Total Capital Expenditure",null,{"$f":"C172+C341","v":210788293},{"$f":"D172+D341","v":25696767},33420752,4030949,22129248,15970506,6158742,0.38563223983009681,31941000.659999996]
[{"$f":"head27a","v":"References"}]
["1. Insert 'Vote'; e.g. Department, if different to standard structure"]

{"sheet":"C6-FinPos","index":14,"n_rows":54,"n_cols":7,"rows_kept":54,"cut":false,"hidden":false,"merged":[[1,0,2,0],[1,1,2,1],[49,0,49,6],[0,0,0,6]]}
[{"$f":"muni& \" - \"&S71E& \" - \"&date","v":"Choose name from list - Table C6 Monthly Budget Statement - Financial Position - Mid-Year Assessment"}]
[{"$f":"desc","v":"Description"},{"$f":"head27","v":"Ref"},{"$f":"Head1","v":"2019/20"},{"$f":"Head2","v":"Budget Year 2020/21"}]
[null,null,{"$f":"Head5","v":"Audited Outcome"},{"$f":"Head6","v":"Original Budget"},{"$f":"Head7","v":"Adjusted Budget"},{"$f":"Head39","v":"YearTD actual"},{"$f":"Head8","v":"Full Year Forecast"}]
["R thousands",1]
["ASSETS"]
["Current assets"]
["Cash",null,6807334,6807334,6807334,9689125,6807334]
["Call investment deposits",null,57134917,60543564,60543564,75938526,60543564]
["Consumer debtors",null,19224680,38919003,38919003,29135362,38919003]
["Other debtors",null,4709595,543000,543000,7509523.7000000002,543000]
["Current portion of long-term receivables",null,0,0,0,0,0]
["Inventory",null,8091,0,0,661370.82000000007,0]
["Total current assets",null,{"$f":"SUM(C7:C12)","v":87884617},{"$f":"SUM(D7:D12)","v":106812901},{"$f":"SUM(E7:E12)","v":106812901},{"$f":"SUM(F7:F12)","v":122933907.52},{"$f":"SUM(G7:G12)","v":106812901}]
[]
["Non current assets"]
["Long-term receivables"]
["Investments"]
["Investment property",null,null,4523600,4523600,10405000,4523600]
["Investments in Associate"]
["Property, plant and equipment",null,141109469,172367288,172367288,157969401.70999998,166121521]
[]
["Biological"]
["Intangible",null,409323,null,null,366059.29000000004]
["Other non-current assets"]
["Total non current assets",null,{"$f":"SUM(C16:C20)+SUM(C22:C24)","v":141518792},{"$f":"SUM(D16:D20)+SUM(D22:D24)","v":176890888},{"$f":"SUM(E16:E20)+SUM(E22:E24)","v":176890888},{"$f":"SUM(F16:F20)+SUM(F22:F24)","v":168740460.99999997},{"$f":"SUM(G16:G20)+SUM(G22:G24)","v":170645121}]
["TOTAL ASSETS",null,{"$f":"C13+C25","v":229403409},{"$f":"D13+D25","v":283703789},{"$f":"E13+E25","v":283703789},{"$f":"F13+F25","v":291674368.51999998},{"$f":"G13+G25","v":277458022}]
[]
["LIABILITIES"]
["Current liabilities"]
["Bank overdraft",null,0,0,0,0,0]
["Borrowing",null,0,0,0,0,0]
["Consumer deposits",null,71200,0,0,71199.87,0]
["Trade and other payables",null,12981395,10352812,10352812,18473223.630000003,5352812]
["Provisions",null,0,2608095,2608095,0,2608095]
["Total current liabilities",null,{"$f":"SUM(C30:C34)","v":13052595},{"$f":"SUM(D30:D34)","v":12960907},{"$f":"SUM(E30:E34)","v":12960907},{"$f":"SUM(F30:F34)","v":18544423.500000004},{"$f":"SUM(G30:G34)","v":7960907}]
[]
["Non current liabilities"]
["Borrowing",null,0,0,0,0,0]
["Provisions",null,2590571,5110195,5110195,2374000,5110195]
["Total non current liabilities",null,{"$f":"SUM(C38:C39)","v":2590571},{"$f":"SUM(D38:D39)","v":5110195},{"$f":"SUM(E38:E39)","v":5110195},{"$f":"SUM(F38:F39)","v":2374000},{"$f":"SUM(G38:G39)","v":5110195}]
["TOTAL LIABILITIES",null,{"$f":"C35+C40","v":15643166},{"$f":"D35+D40","v":18071102},{"$f":"E35+E40","v":18071102},{"$f":"F35+F40","v":20918423.500000004},{"$f":"G35+G40","v":13071102}]
[]
["NET ASSETS",2,{"$f":"C26-C41","v":213760243},{"$f":"D26-D41","v":265632687},{"$f":"E26-E41","v":265632687},{"$f":"F26-F41","v":270755945.01999998},{"$f":"G26-G41","v":264386920}]
[]
["COMMUNITY WEALTH/EQUITY"]
["Accumulated Surplus/(Deficit)",null,213760243,265632687,265632687,270755945.01999998,264386920]
["Reserves",null,0,0,0,0,0]
["TOTAL COMMUNITY WEALTH/EQUITY",2,{"$f":"SUM(C46:C47)","v":213760243},{"$f":"SUM(D46:D47)","v":265632687},{"$f":"SUM(E46:E47)","v":265632687},{"$f":"SUM(F46:F47)","v":270755945.01999998},{"$f":"SUM(G46:G47)","v":264386920}]
[{"$f":"head27a","v":"References"}]
["1. Material variances to be explained in Table SC1"]
["2. Net assets must balance with Total Community Wealth/Equity"]
[]
[]
["check balance",null,{"$f":"C43-C48","v":0},{"$f":"D43-D48","v":0},{"$f":"E43-E48","v":0},{"$f":"F43-F48","v":0},{"$f":"G43-G48","v":0}]

{"sheet":"C7-CFlow","index":15,"n_rows":43,"n_cols":11,"rows_kept":43,"cut":false,"hidden":false,"merged":[[1,0,2,0],[1,1,2,1],[0,0,0,10]]}
[{"$f":"muni& \" - \"&S71F& \" - \"&date","v":"Choose name from list - Table C7 Monthly Budget Statement - Cash Flow  - Mid-Year Assessment"}]
[{"$f":"desc","v":"Description"},{"$f":"head27","v":"Ref"},{"$f":"Head1","v":"2019/20"},{"$f":"Head2","v":"Budget Year 2020/21"}]
[null,null,{"$f":"Head5","v":"Audited Outcome"},{"$f":"Head6","v":"Original Budget"},{"$f":"Head7","v":"Adjusted Budget"},{"$f":"Head38","v":"Monthly actual"},{"$f":"Head39","v":"YearTD actual"},{"$f":"Head40","v":"YearTD budget"},{"$f":"Head41","v":"YTD variance"},{"$f":"Head41","v":"YTD variance"},{"$f":"Head8","v":"Full Year Forecast"}]
["R thousands",1,null,null,null,null,null,null,null,"%"]
["CASH FLOW FROM OPERATING ACTIVITIES"]
["Receipts"]
["Property rates",null,16814377,16814377,16814377,1044867.88,10028124.210000001,8407188,{"$f":"G7-H7","v":1620936.2100000009},{"$f":"IF(I7=0,\"\",I7/H7)","v":0.19280361162376777},16814377]
["Service charges",null,574284,574284,574284,42388.65,264667.08999999997,287142,-22474.910000000033,{"$f":"IF(I8=0,\"\",I8/H8)","v":-7.8271064490739881E-2},574284]
["Other revenue",null,8674725,8674725,8674725,{"$f":"2815541.03-127274","v":2688267.03},{"$f":"8434208.7-892751","v":7541457.6999999993},4337362,3204095.6999999993,{"$f":"IF(I9=0,\"\",I9/H9)","v":0.73871991777490542},8674725.2200000007]
["Transfers and Subsidies - Operational",null,76871147,76871147,76871147,32604000,73319000,73319000,0,{"$f":"IF(I10=0,\"\",I10/H10)","v":""},76871147]
["Transfers and Subsidies - Capital",null,15996000,15996000,15996000,3000000,11000000,11000000,0,{"$f":"IF(I11=0,\"\",I11/H11)","v":""},15996000]
["Interest",null,5733321,5733321,5733321,127274.03,892751.92000000016,2866660,-1973908.0799999998,-0.68857418738183107,5733321]
["Dividends",null,0,0,0,0,0,0,0,"",0]
["Payments"]
["Suppliers and employees",null,-73031191,-106914003,-106914003,-8851747,-60652075,-53457001,{"$f":"H15-G15","v":7195074},-0.13459554156433129,-106913999.53000005]
["Finance charges",null,-2646,-214543,-214543,-16488,-91724,-107271.5,{"$f":"H16-G16","v":-15547.5},0.14493598019977347,0]
["Transfers and Grants",null,0,0,0,0,0,0,{"$f":"H17-G17","v":0},"",0]
["NET CASH FROM/(USED) OPERATING ACTIVITIES",null,{"$f":"SUM(C7:C13)+SUM(C15:C17)","v":51630017},17535308,17535308,30638562.590000004,42302201.920000002,46653079.5,{"$f":"H18-G18","v":4350877.5799999982},9.3260244053128327E-2,{"$f":"SUM(K7:K13)+SUM(K15:K17)","v":17749854.689999953}]
[]
["CASH FLOWS FROM INVESTING ACTIVITIES"]
["Receipts"]
["Proceeds on disposal of PPE",null,null,null,null,null,null,null,{"$f":"G22-H22","v":0},{"$f":"IF(I22=0,\"\",I22/H22)","v":""}]
[]
["Decrease (increase) in non-current receivables",null,null,null,null,null,null,null,{"$f":"G24-H24","v":0},""]
["Decrease (increase) in non-current investments",null,null,null,null,null,null,null,{"$f":"G25-H25","v":0},""]
["Payments"]
["Capital assets",null,189451960,-31941767,-31941767,-4030949,-22129249,-15970883,{"$f":"H27-G27","v":6158366},-0.38559959396108529,31941002]
["NET CASH FROM/(USED) INVESTING ACTIVITIES",null,{"$f":"SUM(C22:C25)+C27","v":189451960},{"$f":"SUM(D22:D25)+D27","v":-31941767},-31941767,-4030949,-22129249,-15970883,{"$f":"H28-G28","v":6158366},-0.38559959396108529,{"$f":"SUM(K22:K25)+K27","v":31941002}]
[]
["CASH FLOWS FROM FINANCING ACTIVITIES"]
["Receipts"]
["Short term loans",null,null,null,null,null,null,null,{"$f":"G32-H32","v":0},{"$f":"IF(I32=0,\"\",I32/H32)","v":""}]
["Borrowing long term/refinancing",null,null,null,null,null,null,null,{"$f":"G33-H33","v":0},""]
["Increase (decrease) in consumer deposits",null,null,null,null,null,null,null,{"$f":"G34-H34","v":0},""]
["Payments",null,null,null,null,null,null,null,null,""]
["Repayment of borrowing",null,null,null,null,null,null,null,{"$f":"H36-G36","v":0},""]
["NET CASH FROM/(USED) FINANCING ACTIVITIES",null,{"$f":"SUM(C32:C34)+C36","v":0},0,0,0,0,0,{"$f":"H37-G37","v":0},"",{"$f":"SUM(K32:K34)+K36","v":0}]
[]
["NET INCREASE/ (DECREASE) IN CASH HELD",null,{"$f":"C18+C28+C37","v":241081977},-14406459,-14406459,26607613.590000004,20172952.920000002,30682196.5,null,null,{"$f":"K18+K28+K37","v":49690856.689999953}]
["Cash/cash equivalents at beginning:",null,65454699,110041000,110041000,null,65454699,{"$f":"IF(E40=0, D40, E40)","v":110041000},null,null,{"$f":"G40","v":65454699}]
["Cash/cash equivalents at month/year end:",null,{"$f":"C39+C40","v":306536676},{"$f":"D39+D40","v":95634541},{"$f":"E39+E40","v":95634541},null,{"$f":"G39+G40","v":85627651.920000002},{"$f":"H39+H40","v":140723196.5},null,null,{"$f":"K39+K40","v":115145555.68999995}]
["References"]
["1. Material variances to be explained in Table SC1"]

{"sheet":"SC1","index":16,"n_rows":47,"n_cols":5,"rows_kept":47,"cut":false,"hidden":false,"merged":[[1,0,2,0],[1,1,2,1],[0,0,0,4]]}
[{"$f":"muni& \" - \"&S71G& \" - \"&date","v":"Choose name from list - Supporting Table SC1 Material variance explanations  - Mid-Year Assessment"}]
[{"$f":"head27","v":"Ref"},{"$f":"desc","v":"Description"}]
[null,null,"Variance","Reasons for material deviations","Remedial or corrective steps/remarks"]
[null,"R thousands"]
[1,{"$f":"'C4-FinPerf RE'!A5","v":"Revenue By Source"}]
[null,"Interest on investment",1032000,"Invest will be mature towards the end of financial year","we will wait for the maturity date of the interest"]
[null,"interest on oustanding Balance",942000,"The municipality does not charge interest on debtors","we will revise during adjustment budget."]
[null,"Fine and Penalties",17000,"the country is still underlock down there movements and number of people acceptable in our poremises is limited","we will revise during adjustment budget."]
[null,"rental ",173000,"we have not yet received rent ","we wiil wait till we receive rental income."]
[2,{"$f":"'C4-FinPerf RE'!A24","v":"Expenditure By Type"}]
[]
[null,"Depreciation & asset impairment",{"$f":"1308000+660000","v":1968000},"impaiment is done on annual bases","this will be addresed to wards the year end"]
[null,"Materials and bulk purchases",794000,"due to lockdown other events are prohibitated","revise during adjustment budget"]
[null,"Transfers and subsidies",88000,"we still waiting invoices from Eskom","invoices are requested on monthly basis"]
[3,{"$f":"RIGHT('C5-Capex'!A40,19)","v":"Capital Expenditure"}]
[null,"Capex",1242502,"Capital project are being priorites hence there is posite varience"]
[]
[]
[]
[4,"Financial Position"]
[]
[]
[]
[]
[5,"Cash Flow"]
[null,"Property rates",1977266.33,"Public works made payments for the whole year.","this will be corrected on adjustment budget"]
[null,"Suppliers and employees",7195074,"Some events are put on hold due to covid 19","Events/project will implement once people are vaccinated"]
[null,"Other revenue",1414889,"we have received more than what we anticipated ","we will revise during adjustment budget."]
[null,"Interest",2161308.4300000002,"interest is matring on annual basis","we will wait for the maturity date of the interest"]
[6,"Measureable performance"]
[]
[]
[]
[]
[7,"Municipal Entities"]
[null,"The municipality does not have entity",0,"The municipality does not have entity","The municipality does not have entity"]
[]
[]
[]
[]
[{"$f":"head27a","v":"References"}]
["1. Revenue for each source, vote and standard classification"]
["2. Expenditure for each type, vote and standard classification"]
["3. Capital expenditure for each vote and standard classification"]
["4. Explain any material variances between the annual budget and the expected financial position based on current trends"]
["5. Cash receipts by source and cash payments by type where not explained under revenue and expenditure"]
["6. For Sept, Dec, Mar and Jun statements explain any material variances in achievement of measurable performance objectives"]

{"sheet":"SC2","index":17,"n_rows":65,"n_cols":8,"rows_kept":65,"cut":false,"hidden":false,"merged":[[1,0,2,0],[1,1,2,1],[1,2,2,2],[0,0,0,7]]}
[{"$f":"muni& \" - \"&S71H& \" - \"&Head57","v":"Choose name from list - Supporting Table SC2 Monthly Budget Statement - performance indicators   - Mid-Year Assessment"}]
["Description of financial indicator","Basis of calculation",{"$f":"head27","v":"Ref"},{"$f":"Head1","v":"2019/20"},{"$f":"Head2","v":"Budget Year 2020/21"}]
[null,null,null,{"$f":"Head5","v":"Audited Outcome"},{"$f":"Head6","v":"Original Budget"},{"$f":"Head7","v":"Adjusted Budget"},{"$f":"Head39","v":"YearTD actual"},{"$f":"Head8","v":"Full Year Forecast"}]
[]
["Borrowing Management"]
[]
["Capital Charges to Operating Expenditure","Interest & principal paid/Operating Expenditure",null,{"$f":"IF(ISERROR((D42-D43)/D45),0,((D42-D43)/D45))","v":4.2419107721656819E-5},{"$f":"IF(ISERROR((E42+E44)/E45),0,((E42+E44)/E45))","v":9.1933715736805602E-2},{"$f":"IF(ISERROR((F42+F44)/F45),0,((F42+F44)/F45))","v":9.1933715736805602E-2},{"$f":"IF(ISERROR((G42+G44)/G45),0,((G42+G44)/G45))","v":7.1996081605555761E-5},{"$f":"IF(ISERROR((H42+H44)/H45),0,((H42+H44)/H45))","v":5.2444319730839781E-2}]
["Borrowed funding of 'own' capital expenditure","Borrowings/Capital expenditure excl. transfers and grants",null,{"$f":"IF(ISERROR(D47/D46),0,(D47/D46))","v":0},{"$f":"IF(ISERROR(E47/E46),0,(E47/E46))","v":0},{"$f":"IF(ISERROR(F47/F46),0,(F47/F46))","v":0},{"$f":"IF(ISERROR(G47/G46),0,(G47/G46))","v":0},{"$f":"IF(ISERROR(H47/H46),0,(H47/H46))","v":0}]
["Safety of Capital"]
["Debt to Equity","Loans, Accounts Payable, Overdraft & Tax Provision/ Funds & Reserves",null,{"$f":"IF(ISERROR(D48/D49),0,(D48/D49))","v":6.0728762363916285E-2},{"$f":"IF(ISERROR(E48/E49),0,(E48/E49))","v":3.8974164350488991E-2},{"$f":"IF(ISERROR(F48/F49),0,(F48/F49))","v":3.8974164350488991E-2},{"$f":"IF(ISERROR(G48/G49),0,(G48/G49))","v":6.8228321371246112E-2},{"$f":"IF(ISERROR(H48/H49),0,(H48/H49))","v":2.0246130179208562E-2}]
["Gearing","Long Term Borrowing/ Funds & Reserves",null,{"$f":"IF(ISERROR(D51/D50),0,(D51/D50))","v":0},{"$f":"IF(ISERROR(E51/E50),0,(E51/E50))","v":0},{"$f":"IF(ISERROR(F51/F50),0,(F51/F50))","v":0},{"$f":"IF(ISERROR(G51/G50),0,(G51/G50))","v":0},{"$f":"IF(ISERROR(H51/H50),0,(H51/H50))","v":0}]
["Liquidity"]
["Current Ratio","Current assets/current liabilities",1,{"$f":"IF(ISERROR(D52/D53),0,(D52/D53))","v":6.7331145262685315},{"$f":"IF(ISERROR(E52/E53),0,(E52/E53))","v":8.2411594342895906},{"$f":"IF(ISERROR(F52/F53),0,(F52/F53))","v":8.2411594342895906},{"$f":"IF(ISERROR(G52/G53),0,(G52/G53))","v":6.6291576829012762},{"$f":"IF(ISERROR(H52/H53),0,(H52/H53))","v":13.417177339215243}]
["Liquidity Ratio","Monetary Assets/Current Liabilities",null,{"$f":"IF(ISERROR(D54/D53),0,(D54/D53))","v":4.8988152164378045},{"$f":"IF(ISERROR(E54/E53),0,(E54/E53))","v":5.1964648770336828},{"$f":"IF(ISERROR(F54/F53),0,(F54/F53))","v":5.1964648770336828},{"$f":"IF(ISERROR(G54/G53),0,(G54/G53))","v":4.617433968761552},{"$f":"IF(ISERROR(H54/H53),0,(H54/H53))","v":8.4602040948349231}]
["Revenue Management"]
["Annual Debtors Collection Rate \n(Payment Level %)","Last 12 Mths Receipts/ Last 12 Mths Billing"]
["Outstanding Debtors to Revenue","Total Outstanding Debtors to Annual Revenue",null,{"$f":"IF(ISERROR(D59/D55),0,(D59/D55))","v":0.24486394717825422},{"$f":"IF(ISERROR(E59/E55),0,(E59/E55))","v":0.36462437026141159},{"$f":"IF(ISERROR(F59/F55),0,(F59/F55))","v":0.32712863324080771},{"$f":"IF(ISERROR(G59/G55),0,(G59/G55))","v":0.44880337953856825},{"$f":"IF(ISERROR(H59/H55),0,(H59/H55))","v":0.32712863324080771}]
["Longstanding Debtors Recovered","Debtors > 12 Mths Recovered/Total Debtors > \n12 Months Old",null,{"$f":"IF(ISERROR(D64/D63),0,(D64/D63))","v":0},{"$f":"IF(ISERROR(E64/E63),0,(E64/E63))","v":0},{"$f":"IF(ISERROR(F64/F63),0,(F64/F63))","v":0},{"$f":"IF(ISERROR(G64/G63),0,(G64/G63))","v":0},{"$f":"IF(ISERROR(H64/H63),0,(H64/H63))","v":0}]
["Creditors Management"]
["Creditors System Efficiency","% of Creditors Paid Within Terms (within MFMA s 65(e))",null,null,null,null,0.14000000000000001]
["Funding of Provisions"]
["Percentage Of Provisions Not Funded","Unfunded Provisions/Total Provisions"]
["Other Indicators"]
["Electricity Distribution Losses","% Volume (units purchased and generated less units sold)/units purchased and generated",2]
["Water Distribution Losses","% Volume (units purchased and own source less units sold)/Total units purchased and own source",2]
["Employee costs","Employee costs/Total Revenue - capital revenue",null,{"$f":"IF(ISERROR(D40/D55),0,(D40/D55))","v":0.37371754057933365},{"$f":"IF(ISERROR(E40/E55),0,(E40/E55))","v":0.41294510662850409},{"$f":"IF(ISERROR(F40/F55),0,(F40/F55))","v":0.37048036103021387},{"$f":"IF(ISERROR(G40/G55),0,(G40/G55))","v":0.25353118547168285},{"$f":"IF(ISERROR(H40/H55),0,(H40/H55))","v":0.3704805848524334}]
["Repairs & Maintenance","R&M/Total Revenue - capital revenue",null,{"$f":"IF(ISERROR(D41/D55),0,(D41/D55))","v":8.5079115600134134E-2},{"$f":"IF(ISERROR(E41/E55),0,(E41/E55))","v":0.15596925908734607},{"$f":"IF(ISERROR(F41/F55),0,(F41/F55))","v":0.13993033574866523},{"$f":"IF(ISERROR(G41/G55),0,(G41/G55))","v":0.19372754751366195},{"$f":"IF(ISERROR(H41/H55),0,(H41/H55))","v":0.13993033574866523}]
["Interest & Depreciation","I&D/Total Revenue - capital revenue",null,{"$f":"IF(ISERROR((D42+D44)/D55),0,((D42+D44)/D55))","v":9.5376900254475927E-2},{"$f":"IF(ISERROR((E42+E44)/E55),0,((E42+E44)/E55))","v":0.10324036761621731},{"$f":"IF(ISERROR((F42+F44)/F55),0,((F42+F44)/F55))","v":9.2623760527467736E-2},{"$f":"IF(ISERROR((G42+G44)/G55),0,((G42+G44)/G55))","v":5.1512427403729566E-5},{"$f":"IF(ISERROR((H42+H44)/H55),0,((H42+H44)/H55))","v":5.2838059526016661E-2}]
["IDP regulation financial viability indicators"]
["i. Debt coverage","(Total Operating Revenue - Operating Grants)/Debt service payments due within financial year)",null,null,null,null,0]
["ii. O/S Service Debtors to Revenue","Total outstanding service debtors/annual revenue received for services"]
["iii. Cost coverage","(Available cash + Investments)/monthly fixed operational expenditure"]
["References"]
["1. Consumer debtors > 12 months old are excluded from current assets."]
["2. Material variances to be explained."]
[]
["Calculations"]
[{"$f":"'C6-FinPos'!A38","v":"Borrowing"},null,null,{"$f":"'C6-FinPos'!C38","v":0},{"$f":"'C6-FinPos'!D38","v":0},{"$f":"'C6-FinPos'!E38","v":0},{"$f":"'C6-FinPos'!F38","v":0},0]
["Total Assets",null,null,{"$f":"'C6-FinPos'!C26","v":229403409},{"$f":"'C6-FinPos'!D26","v":283703789},{"$f":"'C6-FinPos'!E26","v":283703789},{"$f":"'C6-FinPos'!F26","v":291674368.51999998},{"$f":"'C6-FinPos'!G26","v":277458022}]
[{"$f":"'C4-FinPerf RE'!A25","v":"Employee related costs"},null,null,{"$f":"'C4-FinPerf RE'!C25","v":36529095},{"$f":"'C4-FinPerf RE'!D25","v":44691585},{"$f":"'C4-FinPerf RE'!E25","v":44691585},{"$f":"'C4-FinPerf RE'!G25","v":20700872},{"$f":"'C4-FinPerf RE'!K25","v":44691612}]
[{"$f":"A27","v":"Repairs & Maintenance"},null,null,8316075,16880000,16880000,15817893,16880000]
["Interest (finance charges)",null,null,{"$f":"'C4-FinPerf RE'!C29","v":4109},{"$f":"'C4-FinPerf RE'!D29","v":0},{"$f":"'C4-FinPerf RE'!E29","v":0},{"$f":"'C4-FinPerf RE'!G29","v":4206},{"$f":"'C4-FinPerf RE'!K29","v":0}]
["Principal paid",null,null,{"$f":"-'C7-CFlow'!C36","v":0},{"$f":"-'C7-CFlow'!D36","v":0},{"$f":"-'C7-CFlow'!E36","v":0},{"$f":"-'C7-CFlow'!G36","v":0},{"$f":"-'C7-CFlow'!K36","v":0}]
["Depreciation",null,null,{"$f":"'C4-FinPerf RE'!C28","v":9318525},{"$f":"'C4-FinPerf RE'!D28","v":11173339},{"$f":"'C4-FinPerf RE'!E28","v":11173339},null,{"$f":"'C4-FinPerf RE'!K26","v":6373932}]
["Operating expenditure",null,null,{"$f":"'C4-FinPerf RE'!C36","v":96866724},{"$f":"'C4-FinPerf RE'!D36","v":121536902},{"$f":"'C4-FinPerf RE'!E36","v":121536902},{"$f":"'C4-FinPerf RE'!G36","v":58419846},{"$f":"'C4-FinPerf RE'!K36","v":121537128}]
[{"$f":"'C5-Capex'!A40","v":"Total Capital Expenditure"},null,null,{"$f":"'C5-Capex'!C40","v":210788293},{"$f":"'C5-Capex'!D40","v":25696767},{"$f":"'C5-Capex'!E40","v":33420752},{"$f":"'C5-Capex'!G40","v":22129248},{"$f":"'C5-Capex'!K40","v":31941000.659999996}]
["Borrowed funding for capital",null,null,{"$f":"'C5-Capex'!C72","v":0},{"$f":"'C5-Capex'!D72","v":0},{"$f":"'C5-Capex'!E72","v":0},{"$f":"'C5-Capex'!G72","v":0},{"$f":"'C5-Capex'!K72","v":0}]
["Debt",null,null,{"$f":"'C6-FinPos'!C30+'C6-FinPos'!C31+'C6-FinPos'!C33+'C6-FinPos'!C38","v":12981395},{"$f":"'C6-FinPos'!D30+'C6-FinPos'!D31+'C6-FinPos'!D33+'C6-FinPos'!D38","v":10352812},{"$f":"'C6-FinPos'!E30+'C6-FinPos'!E31+'C6-FinPos'!E33+'C6-FinPos'!E38","v":10352812},{"$f":"'C6-FinPos'!F30+'C6-FinPos'!F31+'C6-FinPos'!F33+'C6-FinPos'!F38","v":18473223.630000003},{"$f":"'C6-FinPos'!G30+'C6-FinPos'!G31+'C6-FinPos'!G33+'C6-FinPos'!G38","v":5352812}]
["Equity",null,null,{"$f":"'C6-FinPos'!C48","v":213760243},{"$f":"'C6-FinPos'!D48","v":265632687},{"$f":"'C6-FinPos'!E48","v":265632687},{"$f":"'C6-FinPos'!F48","v":270755945.01999998},{"$f":"'C6-FinPos'!G48","v":264386920}]
[{"$f":"'C6-FinPos'!A47","v":"Reserves"},null,null,{"$f":"'C6-FinPos'!C47","v":0},{"$f":"'C6-FinPos'!D47","v":0},{"$f":"'C6-FinPos'!E47","v":0},{"$f":"'C6-FinPos'!F47","v":0},{"$f":"'C6-FinPos'!G47","v":0}]
[{"$f":"'C6-FinPos'!A38","v":"Borrowing"},null,null,{"$f":"'C6-FinPos'!C38","v":0},{"$f":"'C6-FinPos'!D38","v":0},{"$f":"'C6-FinPos'!E38","v":0},{"$f":"'C6-FinPos'!F38","v":0},{"$f":"'C6-FinPos'!G38","v":0}]
[{"$f":"'C6-FinPos'!A6","v":"Current assets"},null,null,{"$f":"'C6-FinPos'!C13","v":87884617},{"$f":"'C6-FinPos'!D13","v":106812901},{"$f":"'C6-FinPos'!E13","v":106812901},{"$f":"'C6-FinPos'!F13","v":122933907.52},{"$f":"'C6-FinPos'!G13","v":106812901}]
[{"$f":"'C6-FinPos'!A29","v":"Current liabilities"},null,null,{"$f":"'C6-FinPos'!C35","v":13052595},{"$f":"'C6-FinPos'!D35","v":12960907},{"$f":"'C6-FinPos'!E35","v":12960907},{"$f":"'C6-FinPos'!F35","v":18544423.500000004},{"$f":"'C6-FinPos'!G35","v":7960907}]
["Monetary assets",null,null,{"$f":"'C6-FinPos'!C7+'C6-FinPos'!C8","v":63942251},{"$f":"'C6-FinPos'!D7+'C6-FinPos'!D8","v":67350898},{"$f":"'C6-FinPos'!E7+'C6-FinPos'!E8","v":67350898},{"$f":"'C6-FinPos'!F7+'C6-FinPos'!F8","v":85627651},{"$f":"'C6-FinPos'!G7+'C6-FinPos'!G8","v":67350898}]
[{"$f":"'C4-FinPerf RE'!A22","v":"Total Revenue (excluding capital transfers and contributions)"},null,null,{"$f":"'C4-FinPerf RE'!C22","v":97745198},{"$f":"'C4-FinPerf RE'!D22","v":108226455},{"$f":"'C4-FinPerf RE'!E22","v":120631455},{"$f":"'C4-FinPerf RE'!G22","v":81650200},{"$f":"'C4-FinPerf RE'!K22","v":120631455}]
[{"$f":"'C4-FinPerf RE'!A19","v":"Transfers and subsidies"},null,null,{"$f":"'C4-FinPerf RE'!C19","v":69092059},{"$f":"'C4-FinPerf RE'!D19","v":73462500},{"$f":"'C4-FinPerf RE'!E19","v":85867500},{"$f":"'C4-FinPerf RE'!G19","v":65605750},{"$f":"'C4-FinPerf RE'!K19","v":85867500}]
[{"$f":"'C4-FinPerf RE'!A39","v":"Transfers and subsidies - capital (monetary allocations) (National / Provincial and District)"},null,null,{"$f":"'C4-FinPerf RE'!C39","v":16076001},{"$f":"'C4-FinPerf RE'!D39","v":15996000},{"$f":"'C4-FinPerf RE'!E39","v":15996000},{"$f":"'C4-FinPerf RE'!G39","v":11106881},{"$f":"'C4-FinPerf RE'!K39","v":15996000}]
["Debt service payments",null,null,{"$f":"'C7-CFlow'!C12+'C7-CFlow'!C36","v":5733321},{"$f":"'C7-CFlow'!D12+'C7-CFlow'!D36","v":5733321},{"$f":"'C7-CFlow'!E12+'C7-CFlow'!E36","v":5733321},{"$f":"'C7-CFlow'!G16+'C7-CFlow'!G36","v":-91724},{"$f":"'C7-CFlow'!K16+'C7-CFlow'!K36","v":0}]
["Outstanding debtors (receivables)",null,null,{"$f":"'C6-FinPos'!C9+'C6-FinPos'!C10+'C6-FinPos'!C11+'C6-FinPos'!C16","v":23934275},{"$f":"'C6-FinPos'!D9+'C6-FinPos'!D10+'C6-FinPos'!D11+'C6-FinPos'!D16","v":39462003},{"$f":"'C6-FinPos'!E9+'C6-FinPos'!E10+'C6-FinPos'!E11+'C6-FinPos'!E16","v":39462003},{"$f":"'C6-FinPos'!F9+'C6-FinPos'!F10+'C6-FinPos'!F11+'C6-FinPos'!F16","v":36644885.700000003},{"$f":"'C6-FinPos'!G9+'C6-FinPos'!G10+'C6-FinPos'!G11+'C6-FinPos'!G16","v":39462003}]
["Annual services revenue",null,null,{"$f":"SUM('C4-FinPerf RE'!C7:C11)","v":528201},{"$f":"SUM('C4-FinPerf RE'!D7:D11)","v":574287},{"$f":"SUM('C4-FinPerf RE'!E7:E11)","v":574287},{"$f":"SUM('C4-FinPerf RE'!G7:G11)","v":266748}]
["Cash + investments","Including LT investments",null,{"$f":"'C6-FinPos'!C7+'C6-FinPos'!C8+'C6-FinPos'!C17-'C6-FinPos'!C30","v":63942251},{"$f":"'C6-FinPos'!D7+'C6-FinPos'!D8+'C6-FinPos'!D17-'C6-FinPos'!D30","v":67350898},{"$f":"'C6-FinPos'!E7+'C6-FinPos'!E8+'C6-FinPos'!E17-'C6-FinPos'!E30","v":67350898},{"$f":"'C6-FinPos'!F7+'C6-FinPos'!F8+'C6-FinPos'!F17-'C6-FinPos'!F30","v":85627651},{"$f":"'C6-FinPos'!G7+'C6-FinPos'!G8+'C6-FinPos'!G17-'C6-FinPos'!G30","v":67350898}]
["Fixed operational expend. (monthly)"]
["Longstanding debtors outstanding",null,null,{"$f":"'C6-FinPos'!C16","v":0},{"$f":"'C6-FinPos'!D16","v":0},{"$f":"'C6-FinPos'!E16","v":0},{"$f":"'C6-FinPos'!F16","v":0},{"$f":"'C6-FinPos'!G16","v":0}]
["Longstanding debtors recovered"]
["Attorney collections"]

{"sheet":"SC3","index":18,"n_rows":27,"n_cols":14,"rows_kept":27,"cut":false,"hidden":false,"merged":[[0,0,0,12],[1,2,1,13]]}
[{"$f":"muni& \" - \"&S71I& \" - \"&Head57","v":"Choose name from list - Supporting Table SC3 Monthly Budget Statement - aged debtors - Mid-Year Assessment"}]
[{"$f":"desc","v":"Description"},null,{"$f":"Head2","v":"Budget Year 2020/21"}]
["R thousands","NT Code","0-30 Days","31-60 Days","61-90 Days","91-120 Days","121-150 Dys","151-180 Dys","181 Dys-1 Yr","Over 1Yr","Total","Total \nover 90 days","Actual Bad Debts Written Off against Debtors","Impairment - Bad Debts i.t.o Council Policy"]
["Debtors Age Analysis By Income Source"]
["Trade and Other Receivables from Exchange Transactions - Water",1200,0,0,0,0,0,0,0,0,{"$f":"SUM(C5:J5)","v":0},{"$f":"SUM(F5:J5)","v":0}]
["Trade and Other Receivables from Exchange Transactions - Electricity",1300,0,0,0,0,0,0,0,0,{"$f":"SUM(C6:J6)","v":0},{"$f":"SUM(F6:J6)","v":0}]
["Receivables from Non-exchange Transactions - Property Rates",1400,1219162,654404,-780617,616838,453422,434960,2128865,14532333,{"$f":"SUM(C7:J7)","v":19259367},18166418]
["Receivables from Exchange Transactions - Waste Water Management",1500,0,0,0,0,0,0,0,0,0,0]
["Receivables from Exchange Transactions - Waste Management",1600,44617,26658,19651,16683,14939,14424,70926,210133,418031,{"$f":"SUM(F9:J9)","v":327105}]
["Receivables from Exchange Transactions - Property Rental Debtors",1700,0,0,0,0,0,0,0,0,0,{"$f":"SUM(F10:J10)","v":0}]
["Interest on Arrear Debtor Accounts",1810,0,0,0,0,0,0,327606,9130358,9457964,9457964]
["Recoverable unauthorised, irregular, fruitless and wasteful expenditure",1820,0,0,0,0,0,0,0,0,0,0]
["Other",1900,0,0,0,0,0,0,0,0,0,{"$f":"SUM(F13:J13)","v":0}]
["Total By Income Source",2000,{"$f":"SUM(C5:C13)","v":1263779},681062,-760966,633521,468361,449384,2527397,23872824,29135362,{"$f":"SUM(L5:L13)","v":27951487},0,0]
[{"$f":"Head1&\" - totals only\"","v":"2019/20 - totals only"},null,null,null,null,null,null,null,null,null,{"$f":"SUM(C15:J15)","v":0},{"$f":"SUM(F15:J15)","v":0}]
["Debtors Age Analysis By Customer Group"]
["Organs of State",2200,68105,-36119,-207578,44451,42642,41595,89399,613029,{"$f":"SUM(C17:J17)","v":655524},{"$f":"SUM(F17:J17)","v":831116}]
["Commercial",2300,846221,578694,494486,393427,239972,232561,1413537,9028275,{"$f":"SUM(C18:J18)","v":13227173},{"$f":"SUM(F18:J18)","v":11307772}]
["Households",2400,282411,188673,17761,130163,120703,110889,586828,2863229,{"$f":"SUM(C19:J19)","v":4300657},{"$f":"SUM(F19:J19)","v":3811812}]
["Other",2500,67042,-50186,-1065635,65480,65044,64339,437633,11368291,{"$f":"SUM(C20:J20)","v":10952008},{"$f":"SUM(F20:J20)","v":12000787}]
["Total By Customer Group",2600,{"$f":"SUM(C17:C20)","v":1263779},681062,-760966,633521,468361,449384,2527397,{"$f":"SUM(J17:J20)","v":23872824},{"$f":"SUM(K17:K20)","v":29135362},{"$f":"SUM(L17:L20)","v":27951487},{"$f":"SUM(M17:M20)","v":0},{"$f":"SUM(N17:N20)","v":0}]
["Notes"]
["Material increases in value of debtors' categories compared to previous month to be explained"]
["Bad debts = amounts actually written off in the month"]
["Total by Income Source must reconcile with Total by Customer Group"]
[null,null,{"$f":"C14-C21","v":0},{"$f":"D14-D21","v":0},{"$f":"E14-E21","v":0},0,0,0,0,{"$f":"J14-J21","v":0},0]
[null,null,{"$f":"IF(C26=0,\"\",\"MUST AGREE\")","v":""},{"$f":"IF(D26=0,\"\",\"MUST AGREE\")","v":""},"","","","","","",""]

{"sheet":"SC4","index":19,"n_rows":17,"n_cols":12,"rows_kept":17,"cut":false,"hidden":false,"merged":[[1,11,3,11],[0,0,0,10],[2,8,3,8],[2,9,3,9],[2,10,3,10],[2,4,3,4],[2,5,3,5],[2,6,3,6],[2,7,3,7],[1,0,2,0],[1,1,3,1],[2,2,3,2],[2,3,3,3]]}
[{"$f":"muni& \" - \"&S71J& \" - \"&Head57","v":"Choose name from list - Supporting Table SC4 Monthly Budget Statement - aged creditors  - Mid-Year Assessment"}]
[{"$f":"desc","v":"Description"},"NT Code",{"$f":"Head2","v":"Budget Year 2020/21"},null,null,null,null,null,null,null,null,"Prior year totals for chart (same period)"]
[null,null,"0 - \n30 Days","31 - \n60 Days","61 - \n90 Days","91 - \n120 Days","121 - \n150 Days","151 - \n180 Days","181 Days -\n1 Year","Over 1\nYear","Total\n"]
["R thousands"]
["Creditors Age Analysis By Customer Type"]
["Bulk Electricity","0100",0,0,0,0,0,0,0,0,{"$f":"SUM(C6:J6)","v":0},0]
["Bulk Water","0200",0,0,0,0,0,0,0,0,{"$f":"SUM(C7:J7)","v":0},0]
["PAYE deductions","0300",0,0,0,0,0,0,0,0,0,0]
["VAT (output less input)","0400",0,0,0,0,0,0,0,0,0,0]
["Pensions / Retirement deductions","0500",0,0,0,0,0,0,0,0,0,0]
["Loan repayments","0600",0,0,0,0,0,0,0,0,0,0]
["Trade Creditors","0700",0,0,0,0,0,0,0,0,0,0]
["Auditor General","0800",0,0,0,0,0,0,0,0,0,0]
["Other","0900",1175646,0,0,0,0,0,0,0,{"$f":"SUM(C14:J14)","v":1175646},0]
["Total By Customer Type",1000,{"$f":"SUM(C6:C14)","v":1175646},{"$f":"SUM(D6:D14)","v":0},0,0,0,0,0,0,{"$f":"SUM(K6:K14)","v":1175646},{"$f":"SUM(L6:L14)","v":0}]
["Notes"]
["Material increases in value of creditors' categories compared to previous month to be explained"]

{"sheet":"SC5","index":20,"n_rows":28,"n_cols":15,"rows_kept":28,"cut":false,"hidden":false,"merged":[[2,10,2,14],[0,0,0,9],[1,1,2,1],[1,3,2,3],[1,9,2,9]]}
[{"$f":"muni& \" - \"&S71K& \" - \"&Head57","v":"Choose name from list - Supporting Table SC5 Monthly Budget Statement - investment portfolio  - Mid-Year Assessment"}]
["Investments by maturity\nName of institution & investment ID","Ref","Period of Investment","Type of Investment","Capital Guarantee\n(Yes/ No)","Variable or Fixed interest rate","Interest Rate ᶟ","Commission Paid (Rands)","Commission Recipient","Expiry date of investment","Opening balance","Interest to be realised","Partial / Premature Withdrawal (4)","Investment Top Up","Closing Balance"]
["R thousands",null,"Yrs/Months"]
["Municipality"]
["FIXED Deposit Investment",null,"Months","Fixed","no","Fixed Interest rate",4.2750000000000003E-2,0,0,"2021-06-25",30000000,0,0,0,{"$f":"SUM(K5:N5)","v":30000000}]
["Call Investment",null,"Months","Viriable","no","variable",4.2750000000000003E-2,0,0,"2021-06-25",45233789,704737,0,0,45938526]
[null,null,null,null,null,null,null,null,null,null,null,null,null,null,0]
[null,null,null,null,null,null,null,null,null,null,null,null,null,null,0]
[null,null,null,null,null,null,null,null,null,null,null,null,null,null,0]
[null,null,null,null,null,null,null,null,null,null,null,null,null,null,0]
[null,null,null,null,null,null,null,null,null,null,null,null,null,null,0]
["Municipality sub-total",null,null,null,null,null,null,null,null,null,{"$f":"SUM(K5:K11)","v":75233789},null,{"$f":"SUM(M5:M11)","v":0},{"$f":"SUM(N5:N11)","v":0},{"$f":"SUM(O5:O11)","v":75938526}]
[]
["Entities"]
[null,null,null,null,null,null,null,null,null,null,null,null,null,null,{"$f":"SUM(K15:N15)","v":0}]
[null,null,null,null,null,null,null,null,null,null,null,null,null,null,0]
[null,null,null,null,null,null,null,null,null,null,null,null,null,null,0]
[null,null,null,null,null,null,null,null,null,null,null,null,null,null,0]
[null,null,null,null,null,null,null,null,null,null,null,null,null,null,0]
[null,null,null,null,null,null,null,null,null,null,null,null,null,null,0]
[null,null,null,null,null,null,null,null,null,null,null,null,null,null,0]
["Entities sub-total",null,null,null,null,null,null,null,null,null,{"$f":"SUM(K15:K21)","v":0},null,{"$f":"SUM(M15:M21)","v":0},{"$f":"SUM(N15:N21)","v":0},{"$f":"SUM(O15:O21)","v":0}]
[]
["TOTAL INVESTMENTS AND INTEREST",2,null,null,null,null,null,null,null,null,{"$f":"K12+K22","v":75233789},null,{"$f":"M12+M22","v":0},{"$f":"N12+N22","v":0},{"$f":"O12+O22","v":75938526}]
[{"$f":"head27a","v":"References"}]
["2. List investments in expiry date order"]
["3. If 'variable' is selected in column F, input interest rate range"]
["4. Withdrawals to be entered as negative"]

{"sheet":"SC6","index":21,"n_rows":77,"n_cols":11,"rows_kept":77,"cut":false,"hidden":false,"merged":[[1,0,2,0],[1,1,2,1],[0,0,0,10]]}
[{"$f":"muni& \" - \"&S71L& \" - \"&Head57","v":"Choose name from list - Supporting Table SC6 Monthly Budget Statement - transfers and grant receipts  - Mid-Year Assessment"}]
[{"$f":"desc","v":"Description"},{"$f":"head27","v":"Ref"},{"$f":"Head1","v":"2019/20"},{"$f":"Head2","v":"Budget Year 2020/21"}]
[null,null,{"$f":"Head5","v":"Audited Outcome"},{"$f":"Head6","v":"Original Budget"},{"$f":"Head7","v":"Adjusted Budget"},{"$f":"Head38","v":"Monthly actual"},{"$f":"Head39","v":"YearTD actual"},{"$f":"Head40","v":"YearTD budget"},{"$f":"Head41","v":"YTD variance"},{"$f":"Head41","v":"YTD variance"},{"$f":"Head8","v":"Full Year Forecast"}]
["R thousands",null,null,null,null,null,null,null,null,"%"]
["RECEIPTS:","1,2"]
[]
["Operating Transfers and Grants"]
["National Government:",null,{"$f":"SUM(C9:C19)","v":72075000},88678000,88678000,32604000,71502000,71502000,0,{"$f":"IF(I8=0,\"\",I8/H8)","v":""},{"$f":"SUM(K9:K19)","v":88678000}]
["Local Government Equitable Share",null,62733000,79735000,79735000,32604000,62902000,62902000,{"$f":"G9-H9","v":0},"",79735000]
["Finance Management ",null,2435000,2800000,2800000,null,2800000,2800000,null,null,2800000]
["EPWP Incentive",null,1440000,1143000,1143000,0,800000,800000,null,null,1143000]
["Integrated National Electrification Programme",null,5467000,5000000,5000000,0,5000000,5000000,null,null,5000000]
[]
[null,3,null,null,null,null,null,null,0,""]
[null,null,null,null,null,null,null,null,0,""]
[null,null,null,null,null,null,null,null,0,""]
[null,null,null,null,null,null,null,null,0,""]
[null,null,null,null,null,null,null,null,0,""]
["Other transfers and grants [insert description]",null,null,null,null,null,null,null,0,""]
["Provincial Government:",null,{"$f":"SUM(C21:C26)","v":1714000},1817000,1817000,0,1817000,1817000,0,"",{"$f":"SUM(K21:K26)","v":1817000}]
["Library Grant",null,1714000,1817000,1817000,0,1817000,1817000,{"$f":"G21-H21","v":0},"",1817000]
[]
[null,null,null,null,null,null,null,null,0,""]
[null,4,null,null,null,null,null,null,0,""]
[null,null,null,null,null,null,null,null,0,""]
["Other transfers and grants [insert description]",null,null,null,null,null,null,null,0,""]
["District Municipality:",null,{"$f":"SUM(C28:C29)","v":0},0,0,0,0,0,0,"",{"$f":"SUM(K28:K29)","v":0}]
["[insert description]",null,null,null,null,null,null,null,0,""]
[null,null,null,null,null,null,null,null,0,""]
["Other grant providers:",null,{"$f":"SUM(C31:C37)","v":0},0,0,0,0,0,0,"",{"$f":"SUM(K31:K37)","v":0}]
["[insert description]",null,null,null,null,null,null,null,0,""]
[]
[]
[]
[]
[]
[null,null,null,null,null,null,null,null,0,""]
["Total Operating Transfers and Grants",5,{"$f":"C8+C20+C27+C30","v":73789000},90495000,90495000,32604000,73319000,73319000,0,"",{"$f":"K8+K20+K27+K30","v":90495000}]
[]
["Capital Transfers and Grants"]
[{"$f":"A8","v":"National Government:"},null,{"$f":"SUM(C42:C51)","v":16076000},15996000,15996000,3000000,12000000,12000000,0,{"$f":"IF(I41=0,\"\",I41/H41)","v":""},15996000]
["Municipal Infrastructure Grant (MIG)",null,16076000,15996000,15996000,3000000,12000000,12000000,{"$f":"G42-H42","v":0},"",15996000]
[]
[]
[]
[]
[null,null,null,null,null,null,null,null,0,""]
[null,null,null,null,null,null,null,null,0,""]
[null,null,null,null,null,null,null,null,0,""]
[null,null,null,null,null,null,null,null,0,""]
["Other capital transfers [insert description]",null,null,null,null,null,null,null,0,""]
[{"$f":"A20","v":"Provincial Government:"},null,{"$f":"SUM(C53:C58)","v":0},0,0,0,0,0,{"$f":"G52-H52","v":0},{"$f":"IF(I52=0,\"\",I52/H52)","v":""},{"$f":"SUM(K53:K58)","v":0}]
["[insert description]",null,null,null,null,null,null,null,0,{"$f":"IF(I53=0,\"\",I53/H53)","v":""}]
[]
[]
[]
[]
[null,null,null,null,null,null,null,null,0,""]
[{"$f":"A27","v":"District Municipality:"},null,{"$f":"SUM(C60:C61)","v":0},0,0,0,0,0,0,"",{"$f":"SUM(K60:K61)","v":0}]
["[insert description]",null,null,null,null,null,null,null,0,""]
[null,null,null,null,null,null,null,null,0,""]
[{"$f":"A30","v":"Other grant providers:"},null,{"$f":"SUM(C63:C68)","v":0},0,0,0,0,0,0,"",{"$f":"SUM(K63:K68)","v":0}]
["[insert description]",null,null,null,null,null,null,null,0,{"$f":"IF(I63=0,\"\",I63/H63)","v":""}]
[]
[]
[]
[]
[null,null,null,null,null,null,null,null,0,""]
["Total Capital Transfers and Grants",5,{"$f":"C41+C52+C59+C62","v":16076000},{"$f":"D41+D52+D59+D62","v":15996000},15996000,3000000,12000000,12000000,0,"",15996000]
[]
["TOTAL RECEIPTS OF TRANSFERS & GRANTS",5,{"$f":"C38+C69","v":89865000},106491000,106491000,35604000,85319000,85319000,0,"",106491000]
[{"$f":"head27a","v":"References"}]
["1. Each grant is listed by name as gazetted together with the name of the transferring department or municipality, donor or other organisation"]
["2. Grant expenditure must be separately listed for each grant received"]
["3. Replacement of RSC levies"]
["4. Housing subsidies for housing where ownership transferred"]
["5. Total recurrent/capital grants and subsidies must reconcile to the 'Financial Performance' Statement"]

{"sheet":"SC7(1)","index":22,"n_rows":50,"n_cols":11,"rows_kept":50,"cut":false,"hidden":false,"merged":[[1,0,2,0],[1,1,2,1],[0,0,0,10]]}
[{"$f":"muni& \" - \"&S71M& \" - \"&Head57","v":"Choose name from list - Supporting Table SC7(1) Monthly Budget Statement - transfers and grant expenditure  - Mid-Year Assessment"}]
[{"$f":"desc","v":"Description"},{"$f":"head27","v":"Ref"},{"$f":"Head1","v":"2019/20"},{"$f":"Head2","v":"Budget Year 2020/21"}]
[null,null,{"$f":"Head5","v":"Audited Outcome"},{"$f":"Head6","v":"Original Budget"},{"$f":"Head7","v":"Adjusted Budget"},{"$f":"Head38","v":"Monthly actual"},{"$f":"Head39","v":"YearTD actual"},{"$f":"Head40","v":"YearTD budget"},{"$f":"Head41","v":"YTD variance"},{"$f":"Head41","v":"YTD variance"},{"$f":"Head8","v":"Full Year Forecast"}]
["R thousands",null,null,null,null,null,null,null,null,"%"]
["EXPENDITURE"]
[]
["Operating expenditure of Transfers and Grants"]
[{"$f":"'SC6'!A8","v":"National Government:"},null,{"$f":"SUM(C9:C15)","v":72075000},88678000,88678000,6939772,31533434.903333332,44339000,-12805565.096666668,{"$f":"IF(I8=0,\"\",I8/H8)","v":-0.28881041739025842},{"$f":"SUM(K9:K15)","v":88678000}]
[{"$f":"'SC6'!A9","v":"Local Government Equitable Share"},null,62733000,79735000,79735000,6644583,26578333.333333332,39867500,{"$f":"G9-H9","v":-13289166.666666668},-0.33333333333333337,79735000]
[{"$f":"'SC6'!A10","v":"Finance Management "},null,2435000,2800000,2800000,87189,457193.57,1400000,-942806.42999999993,-0.6734331642857142,2800000]
[{"$f":"'SC6'!A11","v":"EPWP Incentive"},null,1440000,1143000,1143000,208000,1134481,571500,562981,0.98509361329833767,1143000]
[{"$f":"'SC6'!A12","v":"Integrated National Electrification Programme"},null,5467000,5000000,5000000,0,3363427,2500000,863427,0.34537079999999998,5000000]
[{"$f":"'SC6'!A13","v":0},null,null,null,null,null,null,null,0,""]
[{"$f":"'SC6'!A14","v":0},null,null,null,null,null,null,null,0,""]
[{"$f":"'SC6'!A19","v":"Other transfers and grants [insert description]"},null,null,null,null,null,null,null,0,""]
[{"$f":"'SC6'!A20","v":"Provincial Government:"},null,{"$f":"SUM(C17:C21)","v":1714000},1817000,1817000,339878,1112074,908500,203574,0.22407705008255366,{"$f":"SUM(K17:K21)","v":1817000}]
[{"$f":"'SC6'!A21","v":"Library Grant"},null,1714000,1817000,1817000,339878,1112074,908500,{"$f":"G17-H17","v":203574},0.22407705008255366,1817000]
[{"$f":"'SC6'!A23","v":0},null,null,null,null,null,null,null,0,""]
[{"$f":"'SC6'!A24","v":0},null,null,null,null,null,null,null,0,""]
[{"$f":"'SC6'!A25","v":0},null,null,null,null,null,null,null,0,""]
[{"$f":"'SC6'!A26","v":"Other transfers and grants [insert description]"},null,null,null,null,null,null,null,0,""]
[{"$f":"'SC6'!A27","v":"District Municipality:"},null,{"$f":"SUM(C23:C24)","v":0},0,{"$f":"SUM(E23:E24)","v":0},0,0,0,0,"",{"$f":"SUM(K23:K24)","v":0}]
[null,null,null,null,null,null,null,null,0,""]
[{"$f":"'SC6'!A28","v":"[insert description]"},null,null,null,null,null,null,null,0,""]
[{"$f":"'SC6'!A30","v":"Other grant providers:"},null,{"$f":"SUM(C26:C27)","v":0},0,0,0,0,0,0,"",{"$f":"SUM(K26:K27)","v":0}]
[null,null,null,null,null,null,null,null,0,""]
[{"$f":"'SC6'!A31","v":"[insert description]"},null,null,null,null,null,null,null,0,""]
["Total operating expenditure of Transfers and Grants:",null,{"$f":"C8+C16+C22+C25","v":73789000},{"$f":"D8+D16+D22+D25","v":90495000},90495000,7279650,32645508.903333332,45247500,-12601991.096666668,-0.27851242823728756,{"$f":"K8+K16+K22+K25","v":90495000}]
[]
["Capital expenditure of Transfers and Grants"]
[{"$f":"'SC6'!A41","v":"National Government:"},null,{"$f":"SUM(C32:C37)","v":16076000},15996000,15996000,289654,11106881,7998000,3108881,{"$f":"IF(I31=0,\"\",I31/H31)","v":0.38870730182545637},15996000]
[{"$f":"'SC6'!A42","v":"Municipal Infrastructure Grant (MIG)"},null,16076000,15996000,15996000,289654,11106881,7998000,{"$f":"G32-H32","v":3108881},0.38870730182545637,15996000]
[{"$f":"'SC6'!A47","v":0},null,null,null,null,null,null,null,0,""]
[{"$f":"'SC6'!A48","v":0},null,null,null,null,null,null,null,0,""]
[{"$f":"'SC6'!A49","v":0},null,null,null,null,null,null,null,0,""]
[{"$f":"'SC6'!A50","v":0},null,null,null,null,null,null,null,0,""]
[{"$f":"'SC6'!A51","v":"Other capital transfers [insert description]"},null,null,null,null,null,null,null,0,""]
[{"$f":"'SC6'!A52","v":"Provincial Government:"},null,{"$f":"SUM(C39:C40)","v":0},0,0,0,0,0,{"$f":"G38-H38","v":0},"",{"$f":"SUM(K39:K40)","v":0}]
[null,null,null,null,null,null,null,null,0,""]
[{"$f":"'SC6'!A58","v":0},null,null,null,null,null,null,null,0,""]
[{"$f":"'SC6'!A59","v":"District Municipality:"},null,{"$f":"SUM(C42:C43)","v":0},0,0,0,0,0,0,"",{"$f":"SUM(K42:K43)","v":0}]
[null,null,null,null,null,null,null,null,0,""]
[{"$f":"'SC6'!A61","v":0},null,null,null,null,null,null,null,0,""]
[{"$f":"'SC6'!A62","v":"Other grant providers:"},null,{"$f":"SUM(C45:C46)","v":0},0,0,0,0,0,0,"",{"$f":"SUM(K45:K46)","v":0}]
[null,null,null,null,null,null,null,null,0,""]
[{"$f":"'SC6'!A68","v":0},null,null,null,null,null,null,null,0,""]
["Total capital expenditure of Transfers and Grants",null,{"$f":"C31+C38+C41+C44","v":16076000},{"$f":"D31+D38+D41+D44","v":15996000},15996000,289654,11106881,7998000,3108881,{"$f":"IF(I47=0,\"\",I47/H47)","v":0.38870730182545637},15996000]
[]
["TOTAL EXPENDITURE OF TRANSFERS AND GRANTS",null,{"$f":"C28+C47","v":89865000},106491000,106491000,7569304,43752389.903333336,53245500,-9493110.0966666676,{"$f":"IF(I49=0,\"\",I49/H49)","v":-0.17828943472531328},106491000]
[{"$f":"head27a","v":"References"}]

{"sheet":"SC7(2)","index":23,"n_rows":50,"n_cols":7,"rows_kept":50,"cut":false,"hidden":false,"merged":[[0,0,0,6],[1,0,2,0],[1,1,2,1],[1,2,1,6]]}
[{"$f":"muni& \" - \"&S71T& \" - \"&Head57","v":"Choose name from list - Supporting Table SC7(2) Monthly Budget Statement - Expenditure against approved rollovers - Mid-Year Assessment"}]
[{"$f":"desc","v":"Description"},{"$f":"head27","v":"Ref"},{"$f":"Head2","v":"Budget Year 2020/21"}]
[null,null,{"$f":"\"Approved Rollover \" &Head1","v":"Approved Rollover 2019/20"},{"$f":"Head38","v":"Monthly actual"},{"$f":"Head39","v":"YearTD actual"},{"$f":"Head41","v":"YTD variance"},{"$f":"Head41","v":"YTD variance"}]
["R thousands",null,null,null,null,null,"%"]
["EXPENDITURE"]
[]
["Operating expenditure of Approved Roll-overs"]
[{"$f":"'SC6'!A8","v":"National Government:"},null,{"$f":"SUM(C9:C15)","v":0},{"$f":"SUM(D9:D15)","v":0},{"$f":"SUM(E9:E15)","v":0},{"$f":"SUM(F9:F15)","v":0},{"$f":"IF(F8=0,\"\",F8/C8)","v":""}]
[{"$f":"'SC6'!A9","v":"Local Government Equitable Share"},null,null,null,null,{"$f":"E9-C9","v":0},{"$f":"IF(F9=0,\"\",F9/C9)","v":""}]
[{"$f":"'SC6'!A10","v":"Finance Management "},null,null,null,null,{"$f":"C10-E10","v":0},""]
[{"$f":"'SC6'!A11","v":"EPWP Incentive"},null,null,null,null,0,""]
[{"$f":"'SC6'!A12","v":"Integrated National Electrification Programme"},null,null,null,null,0,""]
[{"$f":"'SC6'!A13","v":0},null,null,null,null,0,""]
[{"$f":"'SC6'!A14","v":0},null,null,null,null,0,""]
[{"$f":"'SC6'!A19","v":"Other transfers and grants [insert description]"},null,null,null,null,0,""]
[{"$f":"'SC6'!A20","v":"Provincial Government:"},null,{"$f":"SUM(C17:C21)","v":0},{"$f":"SUM(D17:D21)","v":0},{"$f":"SUM(E17:E21)","v":0},{"$f":"SUM(F17:F21)","v":0},""]
[{"$f":"'SC6'!A21","v":"Library Grant"},null,null,null,null,{"$f":"C17-E17","v":0},""]
[{"$f":"'SC6'!A23","v":0},null,null,null,null,{"$f":"C18-E18","v":0},""]
[{"$f":"'SC6'!A24","v":0},null,null,null,null,{"$f":"C19-E19","v":0},""]
[{"$f":"'SC6'!A25","v":0},null,null,null,null,{"$f":"C20-E20","v":0},""]
[{"$f":"'SC6'!A26","v":"Other transfers and grants [insert description]"},null,null,null,null,{"$f":"C21-E21","v":0},""]
[{"$f":"'SC6'!A27","v":"District Municipality:"},null,{"$f":"SUM(C23:C24)","v":0},{"$f":"SUM(D23:D24)","v":0},{"$f":"SUM(E23:E24)","v":0},{"$f":"SUM(F23:F24)","v":0},""]
[null,null,null,null,null,{"$f":"C23-E23","v":0},""]
[{"$f":"'SC6'!A28","v":"[insert description]"},null,null,null,null,{"$f":"C24-E24","v":0},""]
[{"$f":"'SC6'!A30","v":"Other grant providers:"},null,{"$f":"SUM(C26:C27)","v":0},{"$f":"SUM(D26:D27)","v":0},{"$f":"SUM(E26:E27)","v":0},{"$f":"SUM(F26:F27)","v":0},""]
[null,null,null,null,null,{"$f":"C26-E26","v":0},""]
[{"$f":"'SC6'!A31","v":"[insert description]"},null,null,null,null,{"$f":"C27-E27","v":0},""]
["Total operating expenditure of Approved Roll-overs",null,{"$f":"C8+C16+C22+C25","v":0},{"$f":"D8+D16+D22+D25","v":0},{"$f":"E8+E16+E22+E25","v":0},{"$f":"F8+F16+F22+F25","v":0},""]
[null,null,null,null,null,null,""]
["Capital expenditure of Approved Roll-overs",null,null,null,null,null,""]
[{"$f":"'SC6'!A41","v":"National Government:"},null,{"$f":"SUM(C32:C37)","v":0},{"$f":"SUM(D32:D37)","v":0},{"$f":"SUM(E32:E37)","v":0},{"$f":"SUM(F32:F37)","v":0},""]
[{"$f":"'SC6'!A42","v":"Municipal Infrastructure Grant (MIG)"},null,null,null,null,{"$f":"C32-E32","v":0},""]
[{"$f":"'SC6'!A47","v":0},null,null,null,null,0,""]
[{"$f":"'SC6'!A48","v":0},null,null,null,null,0,""]
[{"$f":"'SC6'!A49","v":0},null,null,null,null,0,""]
[{"$f":"'SC6'!A50","v":0},null,null,null,null,0,""]
[{"$f":"'SC6'!A51","v":"Other capital transfers [insert description]"},null,null,null,null,0,""]
[{"$f":"'SC6'!A52","v":"Provincial Government:"},null,{"$f":"SUM(C39:C40)","v":0},{"$f":"SUM(D39:D40)","v":0},{"$f":"SUM(E39:E40)","v":0},{"$f":"SUM(F39:F40)","v":0},""]
[null,null,null,null,null,{"$f":"C39-E39","v":0},""]
[{"$f":"'SC6'!A58","v":0},null,null,null,null,{"$f":"C40-E40","v":0},""]
[{"$f":"'SC6'!A59","v":"District Municipality:"},null,{"$f":"SUM(C42:C43)","v":0},{"$f":"SUM(D42:D43)","v":0},{"$f":"SUM(E42:E43)","v":0},{"$f":"SUM(F42:F43)","v":0},""]
[null,null,null,null,null,{"$f":"C42-E42","v":0},""]
[{"$f":"'SC6'!A61","v":0},null,null,null,null,{"$f":"C43-E43","v":0},""]
[{"$f":"'SC6'!A62","v":"Other grant providers:"},null,{"$f":"SUM(C45:C46)","v":0},{"$f":"SUM(D45:D46)","v":0},{"$f":"SUM(E45:E46)","v":0},{"$f":"SUM(F45:F46)","v":0},""]
[null,null,null,null,null,{"$f":"C45-E45","v":0},""]
[{"$f":"'SC6'!A68","v":0},null,null,null,null,{"$f":"C46-E46","v":0},""]
["Total capital expenditure of Approved Roll-overs",null,{"$f":"C31+C38+C41+C44","v":0},{"$f":"D31+D38+D41+D44","v":0},{"$f":"E31+E38+E41+E44","v":0},{"$f":"F31+F38+F41+F44","v":0},""]
[]
["TOTAL EXPENDITURE OF APPROVED ROLL-OVERS",null,{"$f":"C28+C47","v":0},{"$f":"D28+D47","v":0},{"$f":"E28+E47","v":0},{"$f":"F28+F47","v":0},""]
[{"$f":"head27a","v":"References"}]

{"sheet":"SC8","index":24,"n_rows":116,"n_cols":11,"rows_kept":116,"cut":false,"hidden":false,"merged":[[1,0,2,0],[1,1,2,1],[0,0,0,10]]}
[{"$f":"muni& \" - \"&S71N& \" - \"&Head57","v":"Choose name from list - Supporting Table SC8 Monthly Budget Statement - councillor and staff benefits  - Mid-Year Assessment"}]
["Summary of Employee and Councillor remuneration",{"$f":"head27","v":"Ref"},{"$f":"Head1","v":"2019/20"},{"$f":"Head2","v":"Budget Year 2020/21"}]
[null,null,{"$f":"Head5","v":"Audited Outcome"},{"$f":"Head6","v":"Original Budget"},{"$f":"Head7","v":"Adjusted Budget"},{"$f":"Head38","v":"Monthly actual"},{"$f":"Head39","v":"YearTD actual"},{"$f":"Head40","v":"YearTD budget"},{"$f":"Head41","v":"YTD variance"},{"$f":"Head41","v":"YTD variance"},{"$f":"Head8","v":"Full Year Forecast"}]
["R thousands",null,null,null,null,null,null,null,null,"%"]
[null,1,"A","B","C",null,null,null,null,null,"D"]
["Councillors (Political Office Bearers plus Other)"]
["Basic Salaries and Wages",null,5429725,5752321,5752321,468493,2816259,2876166,{"$f":"G7-H7","v":-59907},{"$f":"IF(I7=0,\"\",I7/H7)","v":-2.0828769966684816E-2},5752320.7299999995]
["Pension and UIF Contributions",null,0,0,0,0,0,0,0,"",0]
["Medical Aid Contributions",null,0,0,0,0,0,0,0,"",0]
["Motor Vehicle Allowance",null,0,0,0,0,0,0,{"$f":"G10-H10","v":0},{"$f":"IF(I10=0,\"\",I10/H10)","v":""},0]
["Cellphone Allowance",null,593830,621600,621600,33300,157500,310800,{"$f":"G11-H11","v":-153300},{"$f":"IF(I11=0,\"\",I11/H11)","v":-0.49324324324324326},621600]
["Housing Allowances",null,0,0,0,0,0,0,{"$f":"G12-H12","v":0},{"$f":"IF(I12=0,\"\",I12/H12)","v":""},0]
["Other benefits and allowances",null,0,0,0,0,0,0,0,"",0]
["Sub Total - Councillors",null,{"$f":"SUM(C7:C13)","v":6023555},6373921,6373921,501793,2973759,3186966,-213207,-6.6899678251980094E-2,6373920.7299999995]
["% increase",4,null,{"$f":"IF(D14=0,\"\",(D14/C14)-1)","v":5.8165983376926134E-2},{"$f":"IF(E14=0,\"\",(E14/C14)-1)","v":5.8165983376926134E-2},null,null,null,null,null,{"$f":"IF(K14=0,\"\",(K14/C14)-1)","v":5.8165938552897645E-2}]
[]
["Senior Managers of the Municipality",3]
["Basic Salaries and Wages",null,3358616,4718457,4718457,257486,1026791,2359230,{"$f":"G18-H18","v":-1332439},{"$f":"IF(I18=0,\"\",I18/H18)","v":-0.56477706709392472},4718456.74]
["Pension and UIF Contributions",null,14295,29458,29458,3616,18468,14730,3738,0.25376782077393073,29458]
["Medical Aid Contributions",null,11470,0,0,5000,20000,0,20000,{"$error":"#DIV/0!"},0]
["Overtime",null,0,0,0,0,0,0,0,"",0]
["Performance Bonus",null,170507,122042,122042,0,0,61020,{"$f":"G22-H22","v":-61020},{"$f":"IF(I22=0,\"\",I22/H22)","v":-1},122041.92]
["Motor Vehicle Allowance",null,2000,0,0,10000,42151,0,{"$f":"G23-H23","v":42151},{"$f":"IF(I23=0,\"\",I23/H23)","v":{"$error":"#DIV/0!"}},0]
["Cellphone Allowance",null,47360,78000,78000,10810,390826,39000,{"$f":"G24-H24","v":351826},{"$f":"IF(I24=0,\"\",I24/H24)","v":9.0211794871794879},78000]
["Housing Allowances",null,59671,13200,13200,0,0,6600,{"$f":"G25-H25","v":-6600},{"$f":"IF(I25=0,\"\",I25/H25)","v":-1},13200]
["Other benefits and allowances",null,37,142,142,0,3908,72,3836,53.277777777777779,142]
["Payments in lieu of leave",null,5403,120931,120931,0,26554,60468,-33914,-0.56085863597274588,120931]
["Long service awards",null,0,0,0,0,0,0,0,"",0]
["Post-retirement benefit obligations",2,0,0,0,0,0,0,0,"",0]
["Sub Total - Senior Managers of Municipality",null,{"$f":"SUM(C18:C29)","v":3669359},5082230,5082230,{"$f":"SUM(F18:F29)","v":286912},{"$f":"SUM(G18:G29)","v":1528698},{"$f":"SUM(H18:H29)","v":2541120},-1012422,{"$f":"IF(I30=0,\"\",I30/H30)","v":-0.39841565923687194},5082229.66]
["% increase",4,null,{"$f":"IF(D30=0,\"\",(D30/C30)-1)","v":0.38504572597012166},{"$f":"IF(E30=0,\"\",(E30/C30)-1)","v":0.38504572597012166},null,null,null,null,null,{"$f":"IF(K30=0,\"\",(K30/C30)-1)","v":0.38504563331088626}]
[]
["Other Municipal Staff"]
["Basic Salaries and Wages",null,24116722,28014700,28014700,2285420,13007099,14007354,{"$f":"G34-H34","v":-1000255},{"$f":"IF(I34=0,\"\",I34/H34)","v":-7.1409275442028519E-2},28014700.34]
["Pension and UIF Contributions",null,3774067,4402609,4402609,407420,2240439,2201310,39129,1.77753246930237E-2,4402606.8499999987]
["Medical Aid Contributions",null,1558246,1893423,1893423,154567,999712,946710,53002,5.5985465454046118E-2,1893422.6800000002]
["Overtime",null,0,0,0,0,0,0,0,"",0]
["Performance Bonus",null,1519641,2167886,2167886,1165946,1462901,1083942,378959,0.34961187960241413,2167885.62]
["Motor Vehicle Allowance",null,167944,0,0,39461,211327,0,{"$f":"G39-H39","v":211327},{"$f":"IF(I39=0,\"\",I39/H39)","v":{"$error":"#DIV/0!"}},0]
["Cellphone Allowance",null,9840,57001,57001,0,70362,28500,{"$f":"G40-H40","v":41862},{"$f":"IF(I40=0,\"\",I40/H40)","v":1.4688421052631579},57001]
["Housing Allowances",null,108931,324047,324047,17611,126213,162024,{"$f":"G41-H41","v":-35811},{"$f":"IF(I41=0,\"\",I41/H41)","v":-0.22102281143534291},324046.7]
["Other benefits and allowances",null,202424,1068111,1068111,20500,166340,534054,-367714,-0.68853336928475395,1068110.17]
["Payments in lieu of leave",null,1437287,1681578,1681578,0,109206,840792,-731586,-0.87011531984129253,1681579.32]
["Long service awards",null,16682,0,0,743466,743466,0,743466,{"$error":"#DIV/0!"},0]
["Post-retirement benefit obligations",2,-52048,0,0,0,35109,0,35109,{"$error":"#DIV/0!"},0]
["Sub Total - Other Municipal Staff",null,{"$f":"SUM(C34:C45)","v":32859736},39609355,39609355,{"$f":"SUM(F34:F45)","v":4834391},{"$f":"SUM(G34:G45)","v":19172174},{"$f":"SUM(H34:H45)","v":19804686},-632512,{"$f":"IF(I46=0,\"\",I46/H46)","v":-3.1937491965285385E-2},39609352.68]
["% increase",4,null,{"$f":"IF(D46=0,\"\",(D46/C46)-1)","v":0.20540697588075574},{"$f":"IF(E46=0,\"\",(E46/C46)-1)","v":0.20540697588075574},null,null,null,null,null,{"$f":"IF(K46=0,\"\",(K46/C46)-1)","v":0.20540690527763217}]
[]
["Total Parent Municipality",null,{"$f":"C14+C30+C46","v":42552650},{"$f":"D14+D30+D46","v":51065506},51065506,5623096,23674631,25532772,{"$f":"G49-H49","v":-1858141},{"$f":"IF(I49=0,\"\",I49/H49)","v":-7.2774746118439468E-2},51065503.07]
[null,null,null,{"$f":"IF(D49=0,\"\",(D49/C49)-1)","v":0.20005466169557007},{"$f":"IF(E49=0,\"\",(E49/C49)-1)","v":0.20005466169557007},null,null,null,null,null,{"$f":"IF(K49=0,\"\",(K49/C49)-1)","v":0.20005459283969396}]
["Unpaid salary, allowances & benefits in arrears:"]
[]
["Board Members of Entities"]
["Basic Salaries and Wages",null,null,null,null,null,null,null,{"$f":"G54-H54","v":0},{"$f":"IF(I54=0,\"\",I54/H54)","v":""}]
["Pension and UIF Contributions",null,null,null,null,null,null,null,0,""]
["Medical Aid Contributions",null,null,null,null,null,null,null,0,""]
["Overtime",null,null,null,null,null,null,null,{"$f":"G57-H57","v":0},{"$f":"IF(I57=0,\"\",I57/H57)","v":""}]
["Performance Bonus",null,null,null,null,null,null,null,{"$f":"G58-H58","v":0},{"$f":"IF(I58=0,\"\",I58/H58)","v":""}]
["Motor Vehicle Allowance",null,null,null,null,null,null,null,{"$f":"G59-H59","v":0},{"$f":"IF(I59=0,\"\",I59/H59)","v":""}]
["Cellphone Allowance",null,null,null,null,null,null,null,{"$f":"G60-H60","v":0},{"$f":"IF(I60=0,\"\",I60/H60)","v":""}]
["Housing Allowances",null,null,null,null,null,null,null,{"$f":"G61-H61","v":0},{"$f":"IF(I61=0,\"\",I61/H61)","v":""}]
["Other benefits and allowances",null,null,null,null,null,null,null,0,""]
["Board Fees",null,null,null,null,null,null,null,{"$f":"G63-H63","v":0},{"$f":"IF(I63=0,\"\",I63/H63)","v":""}]
["Payments in lieu of leave",null,null,null,null,null,null,null,0,""]
["Long service awards",null,null,null,null,null,null,null,0,""]
["Post-retirement benefit obligations",null,null,null,null,null,null,null,0,""]
["Sub Total - Board Members of Entities",2,{"$f":"SUM(C54:C66)","v":0},0,0,{"$f":"SUM(F54:F66)","v":0},{"$f":"SUM(G54:G66)","v":0},{"$f":"SUM(H54:H66)","v":0},0,{"$f":"IF(I67=0,\"\",I67/H67)","v":""},0]
["% increase",4,null,{"$f":"IF(D67=0,\"\",(D67/C67)-1)","v":""},{"$f":"IF(E67=0,\"\",(E67/C67)-1)","v":""},null,null,null,null,null,{"$f":"IF(K67=0,\"\",(K67/C67)-1)","v":""}]
[]
["Senior Managers of Entities"]
["Basic Salaries and Wages",null,null,null,null,null,null,null,{"$f":"G71-H71","v":0},{"$f":"IF(I71=0,\"\",I71/H71)","v":""}]
["Pension and UIF Contributions",null,null,null,null,null,null,null,0,""]
["Medical Aid Contributions",null,null,null,null,null,null,null,0,""]
["Overtime",null,null,null,null,null,null,null,0,""]
["Performance Bonus",null,null,null,null,null,null,null,{"$f":"G75-H75","v":0},{"$f":"IF(I75=0,\"\",I75/H75)","v":""}]
["Motor Vehicle Allowance",null,null,null,null,null,null,null,{"$f":"G76-H76","v":0},{"$f":"IF(I76=0,\"\",I76/H76)","v":""}]
["Cellphone Allowance",null,null,null,null,null,null,null,{"$f":"G77-H77","v":0},{"$f":"IF(I77=0,\"\",I77/H77)","v":""}]
["Housing Allowances",null,null,null,null,null,null,null,{"$f":"G78-H78","v":0},{"$f":"IF(I78=0,\"\",I78/H78)","v":""}]
["Other benefits and allowances",null,null,null,null,null,null,null,0,""]
["Payments in lieu of leave",null,null,null,null,null,null,null,0,""]
["Long service awards",null,null,null,null,null,null,null,0,""]
["Post-retirement benefit obligations",2,null,null,null,null,null,null,0,""]
["Sub Total - Senior Managers of Entities",null,{"$f":"SUM(C71:C82)","v":0},0,0,{"$f":"SUM(F71:F82)","v":0},{"$f":"SUM(G71:G82)","v":0},{"$f":"SUM(H71:H82)","v":0},0,{"$f":"IF(I83=0,\"\",I83/H83)","v":""},0]
["% increase",4,null,{"$f":"IF(D83=0,\"\",(D83/C83)-1)","v":""},{"$f":"IF(E83=0,\"\",(E83/C83)-1)","v":""},null,null,null,null,null,{"$f":"IF(K83=0,\"\",(K83/C83)-1)","v":""}]
[]
["Other Staff of Entities"]
["Basic Salaries and Wages",null,null,null,null,null,null,null,{"$f":"G87-H87","v":0},{"$f":"IF(I87=0,\"\",I87/H87)","v":""}]
["Pension and UIF Contributions",null,null,null,null,null,null,null,0,""]
["Medical Aid Contributions",null,null,null,null,null,null,null,{"$f":"G89-H89","v":0},{"$f":"IF(I89=0,\"\",I89/H89)","v":""}]
["Overtime",null,null,null,null,null,null,null,{"$f":"G90-H90","v":0},{"$f":"IF(I90=0,\"\",I90/H90)","v":""}]
["Performance Bonus",null,null,null,null,null,null,null,{"$f":"G91-H91","v":0},{"$f":"IF(I91=0,\"\",I91/H91)","v":""}]
["Motor Vehicle Allowance",null,null,null,null,null,null,null,{"$f":"G92-H92","v":0},{"$f":"IF(I92=0,\"\",I92/H92)","v":""}]
["Cellphone Allowance",null,null,null,null,null,null,null,0,""]
["Housing Allowances",null,null,null,null,null,null,null,0,""]
["Other benefits and allowances",null,null,null,null,null,null,null,0,""]
["Payments in lieu of leave",null,null,null,null,null,null,null,0,""]
["Long service awards",null,null,null,null,null,null,null,0,""]
["Post-retirement benefit obligations",null,null,null,null,null,null,null,0,""]
["Sub Total - Other Staff of Entities",null,{"$f":"SUM(C87:C98)","v":0},0,0,0,0,0,0,{"$f":"IF(I99=0,\"\",I99/H99)","v":""},{"$f":"SUM(K87:K98)","v":0}]
["% increase",4,null,{"$f":"IF(D99=0,\"\",(D99/C99)-1)","v":""},{"$f":"IF(E99=0,\"\",(E99/C99)-1)","v":""},null,null,null,null,null,{"$f":"IF(K99=0,\"\",(K99/C99)-1)","v":""}]
[]
["Total Municipal Entities",null,{"$f":"C67+C83+C99","v":0},0,0,0,0,0,{"$f":"G102-H102","v":0},{"$f":"IF(I102=0,\"\",I102/H102)","v":""},{"$f":"K67+K83+K99","v":0}]
[]
["TOTAL SALARY, ALLOWANCES & BENEFITS",null,{"$f":"C49+C102","v":42552650},51065506,51065506,5623096,23674631,25532772,{"$f":"G104-H104","v":-1858141},{"$f":"IF(I104=0,\"\",I104/H104)","v":-7.2774746118439468E-2},{"$f":"K49+K102","v":51065503.07}]
["% increase",4,null,{"$f":"IF(D104=0,\"\",(D104/C104)-1)","v":0.20005466169557007},{"$f":"IF(E104=0,\"\",(E104/C104)-1)","v":0.20005466169557007},null,null,null,null,null,{"$f":"IF(K104=0,\"\",(K104/C104)-1)","v":0.20005459283969396}]
["TOTAL MANAGERS AND STAFF",null,{"$f":"C30+C46+C83+C99","v":36529095},44691585,44691585,5121303,20700872,22345806,-1644934,{"$f":"IF(I106=0,\"\",I106/H106)","v":-7.3612650176950428E-2},{"$f":"K30+K46+K83+K99","v":44691582.340000004}]
[{"$f":"head27a","v":"References"}]
["1. Include 'Loans and advances' where applicable if any reportable amounts until phased compliance with s164 of MFMA achieved"]
["2. If benefits in kind are provided (e.g. provision of living quarters) the full market value must be shown as the cost to the municipality"]
["3. s57 of the Systems Act"]
["4. B/A, C/A, D/A"]
["Column Definitions:"]
["A. Audited actual 2005/06 (audited financial statements). If audited amounts unavailable, unaudited amounts must be provided with a note stating these are unaudited"]
["B. The original budget approved by council for the 2006/07 budget year."]
["C. The budget for 2006/07 budget year as adjusted by council resolution in terms of section 28 of the MFMA."]
["D. An estimate of final actual amounts (pre audit - 2006/07 budget year) at the time of preparing the budget for the 2007/08 budget year. This may differ from C."]

{"sheet":"SC9","index":25,"n_rows":66,"n_cols":17,"rows_kept":66,"cut":false,"hidden":false,"merged":[[2,15,3,15],[2,16,3,16],[1,0,2,0],[2,14,3,14],[1,1,2,1],[1,2,1,13],[1,14,1,16]]}
[{"$f":"muni& \" - \"&S71O& \" - \"&Head57","v":"Choose name from list - Supporting Table SC9 Monthly Budget Statement - actuals and revised targets for cash receipts - Mid-Year Assessment"}]
[{"$f":"desc","v":"Description"},{"$f":"head27","v":"Ref"},{"$f":"Head2","v":"Budget Year 2020/21"},null,null,null,null,null,null,null,null,null,null,null,{"$f":"'Template names'!B5","v":"2020/21 Medium Term Revenue & Expenditure Framework"}]
[null,null,"July","August","Sept","October","Nov","Dec","January","Feb","March","April","May","June",{"$f":"Head9","v":"Budget Year 2020/21"},{"$f":"Head10","v":"Budget Year +1 2021/22"},{"$f":"Head11","v":"Budget Year +2 2022/23"}]
["R thousands",1,"Outcome","Outcome","Outcome","Outcome","Outcome","Outcome","Budget","Budget","Budget","Budget","Budget","Budget"]
["Cash Receipts By Source"]
["Property rates",null,2251290.9900000002,784756.92,1320043.77,4457289.46,1489438.9600000002,1044867.88,1405655.571469018,1405655.571469018,1405655.571469018,1405655.571469018,1405655.571469018,{"$f":"O6-SUM(C6:M6)","v":1405655.5714690201},19781621.40881411,20968518.99268695,22226630.132248167]
["Service charges - electricity revenue",null,null,null,null,null,null,null,null,null,null,null,null,0]
["Service charges - water revenue",null,null,null,null,null,null,null,null,null,null,null,null,0]
["Service charges - sanitation revenue",null,null,null,null,null,null,null,null,null,null,null,null,0]
["Service charges - refuse",null,38618.57,38326.53,49147.1,60488.99,35697.25,42388.65,51603,51603,51603,51603,51603,51604.710000000021,574286.80000000005,608744.00800000003,645268.64848000009]
[]
["Rental of facilities and equipment",null,null,null,null,null,null,null,null,null,null,null,null,0]
["Interest earned - external investments",null,169079.03,209517.38,159306.91,122414.04,105160.53,127274.03,492874.68,492874.68,492874.68,492874.68,492874.68,492874.6799999997,3850000,4081000,4325860]
["Interest earned - outstanding debtors",null,null,null,null,null,null,null,null,null,null,null,null,0]
["Dividends received",null,null,null,null,null,null,null,null,null,null,null,null,0]
["Fines, penalties and forfeits",null,null,null,null,2133.91,2,null,null,null,null,null,null,-2135.91]
["Licences and permits",null,345918.21,242613.33,347747.81,477817.36,945406,405995,725802.15700000012,725802.15700000012,725802.15700000012,725802.15700000012,725802.15700000012,725802.15700000152,7120310.6520000007,7547529.2911200002,8000381.0485872012]
["Agency services",null,null,null,null,null,null,null,null,null,null,null,null,0]
["Transfers and Subsidies - Operational",null,{"$f":"30298000+2800000","v":33098000},{"$f":"286000+3000000","v":3286000},null,1817000,2514000,32604000,null,null,12176000,null,null,0,85495000,75423000,80081000]
["Other revenue",null,49309.770000000004,53226.420000000006,25102.29,1740,42699,2282272,163897.76379999999,163897.76379999999,163897.76379999999,163897.76379999999,163897.76379999999,163897.76380000077,3437736.0628,3591874.249016,3753217.0918028802]
["Cash Receipts by Source",null,{"$f":"SUM(C6:C10)+SUM(C12:C20)","v":35952216.570000008},{"$f":"SUM(D6:D10)+SUM(D12:D20)","v":4614440.58},1901347.8800000001,6938883.7599999998,5132403.74,36506797.560000002,2839833.1722690184,2839833.1722690184,15015833.172269018,2839833.1722690184,2839833.1722690184,2837698.9722690219,120258954.92361411,112220666.54082295,119032356.92111826]
[null,null,null,null,null,null,null,null,null,null,null,null,null,{"$f":"O22-SUM(C22:M22)","v":0}]
["Other Cash Flows by Source",null,null,null,null,null,null,null,null,null,null,null,null,0]
[{"$f":"'C4-FinPerf RE'!A39","v":"Transfers and subsidies - capital (monetary allocations) (National / Provincial and District)"},null,4000000,null,5000000,null,0,3000000,null,null,3996000,null,null,0,15996000,17027000,17781000]
[{"$f":"'C4-FinPerf RE'!A40","v":"Transfers and subsidies - capital (monetary allocations) (National / Provincial Departmental Agencies, Households, Non-profit Institutions, Private Enterprises, Public Corporatons, Higher Educational Institutions)"},null,null,null,null,null,null,null,null,null,null,null,null,0]
["Proceeds on Disposal of Fixed and Intangible Assets",null,null,null,null,null,null,null,null,null,null,null,null,0]
["Short term loans",null,null,null,null,null,null,null,null,null,null,null,null,0]
["Borrowing long term/refinancing",null,null,null,null,null,null,null,null,null,null,null,null,0]
["Increase (decrease) in consumer deposits",null,null,null,null,null,null,null,null,null,null,null,null,0]
[]
["Decrease (increase) in non-current receivables",null,null,null,null,null,null,null,null,null,null,null,null,0]
["Decrease (increase) in non-current investments",null,null,null,null,null,null,null,null,null,null,null,null,0]
["Total Cash Receipts by Source",null,{"$f":"SUM(C21:C29)+SUM(C31:C32)","v":39952216.570000008},{"$f":"SUM(D21:D29)+SUM(D31:D32)","v":4614440.58},6901347.8799999999,6938883.7599999998,5132403.74,39506797.560000002,2839833.1722690184,2839833.1722690184,19011833.172269017,2839833.1722690184,2839833.1722690184,2837698.9722690219,136254954.92361411,129247666.54082295,136813356.92111826]
[null,null,null,null,null,null,null,null,null,null,null,null,null,{"$f":"O34-SUM(C34:M34)","v":0}]
["Cash Payments by Type",null,null,null,null,null,null,null,null,null,null,null,null,0]
["Employee related costs",null,2601639.04,3586701.55,3122580,3053089,3242149,5121303,3523187.5314729828,3523187.5314729828,3523187.5314729828,3523187.5314729828,3523187.5314729828,3523187.5314729884,41866586.778837897,44587914.919462301,47486129.389227398]
["Remuneration of councillors",null,464793.1,501793.1,501793,501793,501793,501793,547345.34458333335,547345.34458333335,547345.34458333335,547345.34458333335,547345.34458333335,547345.34458333254,6257830.2675000001,6539641.7808750002,6577412.51991875]
["Interest paid",null,20077.64,24927.469999999998,48761,29429,15488,16098,9960.3313333333354,9960.3313333333354,9960.3313333333354,9960.3313333333354,9960.3313333333354,9960.3313333333354,214543.098,235997.40779999999,259597.14858000001]
["Bulk purchases - Electricity",null,null,null,null,null,null,null,null,null,null,null,null,0]
["Bulk purchases - Water & Sewer",null,null,null,null,null,null,null,null,null,null,null,null,0]
["Other materials",null,null,null,92225,823445,511435,321575,1758244.5,1758244.5,1758244.5,1758244.5,1758244.5,1758244.5,12298147,12790073,13301676]
["Contracted services",null,{"$f":"4235018.3-3064479","v":1170539.2999999998},2698899.53,5657956,2447436,3600477,489021,1492663.5283333333,1492663.5283333333,1492663.5283333333,1492663.5283333333,1492663.5283333333,1492663.5283333361,25020310,26021123,27061967]
["Grants and subsidies paid - other municipalities",null,12680.26,14109.44,13356,13483,12656,0,null,null,null,null,null,-66284.7]
["Grants and subsidies paid - other",null,null,null,0,null,null,null,null,null,null,null,null,0]
["General expenses",null,219292.67,1565360.0100000002,765541,{"$f":"2025984+5806295.9","v":7832279.9000000004},null,8626121.0800000131,null,null,null,null,null,-5598526.7262832113,13410067.9337168,14214671,14783257]
["Cash Payments by Type",{"$f":"SUM(B36:B45)","v":0},{"$f":"SUM(C36:C45)","v":4489022.01},{"$f":"SUM(D36:D45)","v":8391791.1000000015},10202212,14700954.9,7883998,15075911.080000013,7331401.2357229823,7331401.2357229823,7331401.2357229823,7331401.2357229823,7331401.2357229823,1666589.8094397793,99067485.078054696,104389421.10813729,109470039.05772614]
[null,null,null,null,null,null,null,null,null,null,null,null,null,{"$f":"O47-SUM(C47:M47)","v":0}]
["Other Cash Flows/Payments by Type"]
["Capital assets",null,6273247,455488,1298996,5896600,4173969,4030949,null,null,null,null,null,{"$f":"O49-SUM(C49:M49)","v":-22129249}]
["Repayment of borrowing",null,null,null,null,null,null,null,null,null,null,null,null,{"$f":"O50-SUM(C50:M50)","v":0}]
["Other Cash Flows/Payments",null,null,null,null,null,null,null,null,null,null,null,null,{"$f":"O51-SUM(C51:M51)","v":31941000},31941000,32227000,24381000]
["Total Cash Payments by Type",{"$f":"SUM(B46:B51)","v":0},10762269.01,8847279.1000000015,11501208,20597554.899999999,12057967,19106860.080000013,7331401.2357229823,7331401.2357229823,7331401.2357229823,7331401.2357229823,7331401.2357229823,11478340.809439778,131008485.0780547,136616421.10813731,133851039.05772614]
[null,null,null,null,null,null,null,null,null,null,null,null,null,{"$f":"O53-SUM(C53:M53)","v":0}]
["NET INCREASE/(DECREASE) IN CASH HELD",{"$f":"B33-B52","v":0},29189947.56000001,-4232838.5200000014,-4599860.12,-13658671.139999999,-6925563.2599999998,20399937.479999989,-4491568.063453964,-4491568.063453964,11680431.936546035,-4491568.063453964,-4491568.063453964,-8640641.8371707574,5246469.8455594182,-7368754.5673143566,2962317.8633921146]
["Cash/cash equivalents at the month/year beginning:",null,65454699,{"$f":"C56","v":94644646.560000002},{"$f":"D56","v":90411808.040000007},85811947.920000002,72153276.780000001,65227713.520000003,85627651,81136082.936546043,76644514.873092085,88324946.809638113,83833378.746184155,79341810.682730198,{"$f":"C55","v":65454699},{"$f":"O56","v":70701168.845559418},{"$f":"P56","v":63332414.278245062}]
["Cash/cash equivalents at the month/year end:",null,{"$f":"C54+C55","v":94644646.560000002},{"$f":"D54+D55","v":90411808.040000007},{"$f":"E54+E55","v":85811947.920000002},72153276.780000001,65227713.520000003,85627651,81136082.936546043,76644514.873092085,88324946.809638113,83833378.746184155,79341810.682730198,70701168.845559448,{"$f":"O54+O55","v":70701168.845559418},{"$f":"P54+P55","v":63332414.278245062},{"$f":"Q54+Q55","v":66294732.141637176}]
[{"$f":"head27a","v":"References"}]
["1. Replace 'budget' heading with adjusted budget, or 'outcome' only for month/s complete"]
["2. Total of monthly amounts must always agree to the approved or adjusted budget"]
["3. Amend 'cash-at-beginning' when prior year actual known (as part of the adjustments budget)"]
[]
[]
[]
[]
[null,null,null,null,{"$f":"E46+E64","v":10202212},14700954.9,7883998,15075911.080000013,7331401.2357229823,7331401.2357229823,7331401.2357229823,7331401.2357229823,null,{"$f":"N46+N64","v":1666589.8094397793},99067485.078054696,104389421.10813729]
[null,null,null,null,{"$f":"E54-E64","v":-4599860.12},-13658671.139999999,-6925563.2599999998,20399937.479999989,-4491568.063453964,-4491568.063453964,11680431.936546035,-4491568.063453964,{"$f":"M54-M64","v":-4491568.063453964},{"$f":"N54-N64","v":-8640641.8371707574},5246469.8455594182,-7368754.5673143566]

{"sheet":"SC10","index":26,"n_rows":46,"n_cols":11,"rows_kept":46,"cut":false,"hidden":false,"merged":[[1,0,2,0],[1,1,2,1],[0,0,0,10]]}
[{"$f":"muni& \" - \"&S71P& \" - \"&Head57","v":"Choose name from list - NOT REQUIRED - municipality does not have entities or this is the parent municipality's budget - Mid-Year Assessment"}]
[{"$f":"desc","v":"Description"},{"$f":"head27","v":"Ref"},{"$f":"Head1","v":"2019/20"},{"$f":"Head2","v":"Budget Year 2020/21"}]
[null,null,{"$f":"Head5","v":"Audited Outcome"},{"$f":"Head6","v":"Original Budget"},{"$f":"Head7","v":"Adjusted Budget"},{"$f":"Head38","v":"Monthly actual"},{"$f":"Head39","v":"YearTD actual"},{"$f":"Head40","v":"YearTD budget"},{"$f":"Head41","v":"YTD variance"},{"$f":"Head41","v":"YTD variance"},{"$f":"Head8","v":"Full Year Forecast"}]
["R thousands",1,null,null,null,null,null,null,null,"%"]
[{"$f":"'C4-FinPerf RE'!A5","v":"Revenue By Source"}]
[{"$f":"'C4-FinPerf RE'!A6","v":"Property rates"},null,null,null,null,null,null,null,{"$f":"G6-H6","v":0},{"$f":"IF(I6=0,\"\",I6/H6)","v":""}]
[{"$f":"'C4-FinPerf RE'!A7","v":"Service charges - electricity revenue"},null,null,null,null,null,null,null,0,{"$f":"IF(I7=0,\"\",I7/H7)","v":""}]
[{"$f":"'C4-FinPerf RE'!A8","v":"Service charges - water revenue"},null,null,null,null,null,null,null,0,""]
[{"$f":"'C4-FinPerf RE'!A9","v":"Service charges - sanitation revenue"},null,null,null,null,null,null,null,0,""]
[{"$f":"'C4-FinPerf RE'!A10","v":"Service charges - refuse revenue"},null,null,null,null,null,null,null,0,""]
[]
[{"$f":"'C4-FinPerf RE'!A12","v":"Rental of facilities and equipment"},null,null,null,null,null,null,null,0,""]
[{"$f":"'C4-FinPerf RE'!A13","v":"Interest earned - external investments"},null,null,null,null,null,null,null,0,""]
[{"$f":"'C4-FinPerf RE'!A14","v":"Interest earned - outstanding debtors"},null,null,null,null,null,null,null,0,""]
[{"$f":"'C4-FinPerf RE'!A15","v":"Dividends received"},null,null,null,null,null,null,null,0,""]
[{"$f":"'C4-FinPerf RE'!A16","v":"Fines, penalties and forfeits"},null,null,null,null,null,null,null,0,""]
[{"$f":"'C4-FinPerf RE'!A17","v":"Licences and permits"},null,null,null,null,null,null,null,0,""]
[{"$f":"'C4-FinPerf RE'!A18","v":"Agency services"},null,null,null,null,null,null,null,0,""]
[{"$f":"'C4-FinPerf RE'!A19","v":"Transfers and subsidies"},null,null,null,null,null,null,null,0,""]
[{"$f":"'C4-FinPerf RE'!A20","v":"Other revenue"},null,null,null,null,null,null,null,0,""]
[{"$f":"'C4-FinPerf RE'!A21","v":"Gains"},null,null,null,null,null,null,null,0,""]
["Total Revenue (excluding capital transfers and contributions)",null,{"$f":"SUM(C6:C10)+SUM(C12:C21)","v":0},0,0,0,0,0,{"$f":"G22-H22","v":0},"",{"$f":"SUM(K6:K10)+SUM(K12:K21)","v":0}]
[]
["Expenditure By Type"]
[{"$f":"'C4-FinPerf RE'!A25","v":"Employee related costs"},null,null,null,null,null,null,null,{"$f":"G25-H25","v":0},{"$f":"IF(I25=0,\"\",I25/H25)","v":""}]
[{"$f":"'C4-FinPerf RE'!A26","v":"Remuneration of councillors"},null,null,null,null,null,null,null,0,""]
[{"$f":"'C4-FinPerf RE'!A27","v":"Debt impairment"},null,null,null,null,null,null,null,0,""]
[{"$f":"'C4-FinPerf RE'!A28","v":"Depreciation & asset impairment"},null,null,null,null,null,null,null,0,""]
[{"$f":"'C4-FinPerf RE'!A29","v":"Finance charges"},null,null,null,null,null,null,null,0,""]
[{"$f":"'C4-FinPerf RE'!A30","v":"Bulk purchases"},null,null,null,null,null,null,null,0,""]
[{"$f":"'C4-FinPerf RE'!A31","v":"Other materials"},null,null,null,null,null,null,null,0,""]
[{"$f":"'C4-FinPerf RE'!A32","v":"Contracted services"},null,null,null,null,null,null,null,0,""]
[{"$f":"'C4-FinPerf RE'!A33","v":"Transfers and subsidies"},null,null,null,null,null,null,null,0,""]
[{"$f":"'C4-FinPerf RE'!A34","v":"Other expenditure"},null,null,null,null,null,null,null,0,""]
[{"$f":"'C4-FinPerf RE'!A35","v":"Losses"},null,null,null,null,null,null,null,0,""]
["Total Expenditure",null,{"$f":"SUM(C25:C35)","v":0},0,0,0,0,0,0,"",{"$f":"SUM(K25:K35)","v":0}]
[null,null,null,null,null,null,null,null,0]
[{"$f":"'C4-FinPerf RE'!A38","v":"Surplus/(Deficit)"},null,{"$f":"C22-C36","v":0},0,0,0,0,0,0,"",{"$f":"K22-K36","v":0}]
[{"$f":"'C4-FinPerf RE'!A39","v":"Transfers and subsidies - capital (monetary allocations) (National / Provincial and District)"},null,null,null,null,null,null,null,0,""]
[{"$f":"'C4-FinPerf RE'!A40","v":"Transfers and subsidies - capital (monetary allocations) (National / Provincial Departmental Agencies, Households, Non-profit Institutions, Private Enterprises, Public Corporatons, Higher Educational Institutions)"},null,null,null,null,null,null,null,0,""]
[{"$f":"'C4-FinPerf RE'!A41","v":"Transfers and subsidies - capital (in-kind - all) "},null,null,null,null,null,null,null,0,""]
[{"$f":"'C4-FinPerf RE'!A42","v":"Surplus/(Deficit) after capital transfers & contributions"},null,{"$f":"C38+SUM(C39:C41)","v":0},{"$f":"D38+SUM(D39:D41)","v":0},0,0,0,0,0,"",0]
[{"$f":"'C4-FinPerf RE'!A43","v":"Taxation"},null,null,null,null,null,null,null,0,""]
[{"$f":"'C4-FinPerf RE'!A44","v":"Surplus/(Deficit) after taxation"},null,{"$f":"C42-C43","v":0},0,0,0,0,0,0,"",{"$f":"K42-K43","v":0}]
[{"$f":"head27a","v":"References"}]
["1. Votes (consolidated) are revenue sources and expenditure type"]

{"sheet":"SC11","index":27,"n_rows":49,"n_cols":11,"rows_kept":49,"cut":false,"hidden":false,"merged":[[1,0,2,0],[1,1,2,1],[0,0,0,10],[1,3,1,10]]}
[{"$f":"muni& \" - \"&S71Q& \" - \"&Head57","v":"Choose name from list - NOT REQUIRED - municipality does not have entities or this is the parent municipality's budget - Mid-Year Assessment"}]
[{"$f":"desc","v":"Description"},{"$f":"head27","v":"Ref"},{"$f":"Head1","v":"2019/20"},{"$f":"Head2","v":"Budget Year 2020/21"}]
[null,null,{"$f":"Head5","v":"Audited Outcome"},{"$f":"Head6","v":"Original Budget"},{"$f":"Head7","v":"Adjusted Budget"},{"$f":"Head38","v":"Monthly actual"},{"$f":"Head39","v":"YearTD actual"},{"$f":"Head40","v":"YearTD budget"},{"$f":"Head41","v":"YTD variance"},{"$f":"Head41","v":"YTD variance"},{"$f":"Head8","v":"Full Year Forecast"}]
["R thousands",null,null,null,null,null,null,null,null,"%"]
["Revenue By Municipal Entity"]
["Insert name of municipal entity",null,null,null,null,null,null,null,{"$f":"G6-H6","v":0},{"$f":"IF(I6=0,\"\",I6/H6)","v":""}]
[null,null,null,null,null,null,null,null,0,{"$f":"IF(I7=0,\"\",I7/H7)","v":""}]
[null,null,null,null,null,null,null,null,0,""]
[null,null,null,null,null,null,null,null,0,""]
[null,null,null,null,null,null,null,null,0,""]
[null,null,null,null,null,null,null,null,0,""]
[null,null,null,null,null,null,null,null,0,""]
[null,null,null,null,null,null,null,null,0,""]
[null,null,null,null,null,null,null,null,0,""]
[null,null,null,null,null,null,null,null,0,""]
["Total Operating Revenue",1,{"$f":"SUM(C6:C15)","v":0},0,0,0,0,0,0,"",{"$f":"SUM(K6:K15)","v":0}]
[]
["Expenditure By Municipal Entity"]
[{"$f":"A6","v":"Insert name of municipal entity"},null,null,null,null,null,null,null,0,{"$f":"IF(I19=0,\"\",I19/H19)","v":""}]
[{"$f":"IF(A7=\"\",\"\",A7)","v":""},null,null,null,null,null,null,null,0,""]
[{"$f":"IF(A8=\"\",\"\",A8)","v":""},null,null,null,null,null,null,null,0,""]
["",null,null,null,null,null,null,null,0,""]
["",null,null,null,null,null,null,null,0,""]
["",null,null,null,null,null,null,null,0,""]
["",null,null,null,null,null,null,null,0,""]
["",null,null,null,null,null,null,null,0,""]
["",null,null,null,null,null,null,null,0,""]
["",null,null,null,null,null,null,null,0,""]
["Total Operating Expenditure",2,{"$f":"SUM(C19:C28)","v":0},0,0,0,0,0,0,"",{"$f":"SUM(K19:K28)","v":0}]
[null,null,null,null,null,null,null,null,null,""]
[{"$f":"Head42","v":"Surplus/ (Deficit) for the yr/period"},null,{"$f":"C16-C29","v":0},{"$f":"D16-D29","v":0},0,0,0,0,{"$f":"I16+I29","v":0},"",0]
["Capital Expenditure By Municipal Entity"]
[{"$f":"$A$6","v":"Insert name of municipal entity"},null,null,null,null,null,null,null,0,""]
[{"$f":"IF(A7=\"\",\"\",A7)","v":""},null,null,null,null,null,null,null,0,""]
[{"$f":"IF(A8=\"\",\"\",A8)","v":""},null,null,null,null,null,null,null,0,""]
["",null,null,null,null,null,null,null,0,""]
["",null,null,null,null,null,null,null,0,""]
["",null,null,null,null,null,null,null,0,""]
["",null,null,null,null,null,null,null,0,""]
["",null,null,null,null,null,null,null,0,""]
["",null,null,null,null,null,null,null,0,""]
[null,null,null,null,null,null,null,null,null,""]
["Total Capital Expenditure",3,{"$f":"SUM(C32:C42)","v":0},{"$f":"SUM(D32:D42)","v":0},0,0,0,{"$f":"SUM(H32:H42)","v":0},{"$f":"G43-H43","v":0},"",0]
[{"$f":"head27a","v":"References"}]
["1. Must reconcile to the sum of all municipal entity monthly revenue reports"]
["2. Must reconcile to the sum of all municipal entity monthly expenditure reports"]
["3. YTD = Year to date; FAV - favourable variance or unfavourable variance"]
["4. Material variances to be explained"]
["5. Insert additional 'Adjustment' Budget column for each Adjustment made by an entity"]

{"sheet":"SC12","index":28,"n_rows":18,"n_cols":10,"rows_kept":18,"cut":false,"hidden":false,"merged":[[1,0,2,0],[0,0,0,9],[1,2,1,9]]}
[{"$f":"muni& \" - \"&S71R& \" - \"&Head57","v":"Choose name from list - Supporting Table SC12 Monthly Budget Statement - capital expenditure trend - Mid-Year Assessment"}]
["Month",{"$f":"Head1","v":"2019/20"},{"$f":"Head2","v":"Budget Year 2020/21"}]
[null,{"$f":"Head5","v":"Audited Outcome"},{"$f":"Head6","v":"Original Budget"},{"$f":"Head7","v":"Adjusted Budget"},{"$f":"Head38","v":"Monthly actual"},{"$f":"Head39","v":"YearTD actual"},{"$f":"Head40","v":"YearTD budget"},{"$f":"Head41","v":"YTD variance"},{"$f":"Head41","v":"YTD variance"},"% spend of Original Budget"]
["R thousands",null,null,null,null,null,null,null,"%"]
["Monthly expenditure performance trend"]
["July",15787663.333333334,2661750,2661750,6273247,{"$f":"IF(E6>0,E6,\"\")","v":6273247},{"$f":"IF(D6>0,D6,C6)","v":2661750},{"$f":"IF(F6=\"\",0,G6-F6)","v":-3611497},{"$f":"IF(F6=\"\",\"\",IF(H6=0,\"\",H6/G6))","v":-1.3568129989668452},{"$f":"IF(F6=\"\",\"\",F6/$C$18)","v":0.1964010832472371}]
["August",15787663.333333334,2661750,2661750,455488,{"$f":"IF(E7>0,E7+F6,\"\")","v":6728735},{"$f":"IF(D7>0,D7+D6,C7+C6)","v":5323500},-1405235,-0.26396825396825396,0.21066137566137566]
["September",15787663.333333334,2661750,2661750,1298996,{"$f":"IF(E8>0,E8+F7,\"\")","v":8027731},{"$f":"IF(D8>0,D8+G7,C8+G7)","v":7985250},-42481,-5.3199336276259354E-3,0.25132998340690649]
["October",15787663.333333334,2661750,2661750,5896600,13924331,{"$f":"IF(D9>0,D9+G8,C9+G8)","v":10647000},-3277331,-0.30781731943270407,0.43593910647756801]
["November",15787663.333333334,2661750,2661750,4173969,18098300,13308750,-4789550,-0.35987977834131679,0.56661657430888202]
["December",15787663.333333334,2661750,2661750,4030949,22129249,15970500,-6158749,-0.3856328230174384,0.6928164115087192]
["January",15787663.333333334,2661750,2661750,0,"",18632250,0,"",""]
["February",15787663.333333334,2661750,2661750,0,"",21294000,0,"",""]
["March",15787663.333333334,2661750,2661750,0,"",23955750,0,"",""]
["April",15787663.333333334,2661750,2661750,0,"",26617500,0,"",""]
["May",15787663.333333334,2661750,2661750,0,"",29279250,0,"",""]
["June",15787663.333333334,2661750,2661750,0,"",31941000,{"$f":"IF(F17=\"\",0,G17-F17)","v":0},{"$f":"IF(F17=\"\",\"\",IF(H17=0,\"\",H17/G17))","v":""},{"$f":"IF(F17=\"\",\"\",F17/$C$18)","v":""}]
["Total Capital expenditure",{"$f":"SUM(B6:B17)","v":189451960.00000003},{"$f":"SUM(C6:C17)","v":31941000},{"$f":"SUM(D6:D17)","v":31941000},{"$f":"SUM(E6:E17)","v":22129249}]

{"sheet":"SC13a","index":29,"n_rows":171,"n_cols":11,"rows_kept":171,"cut":false,"hidden":false,"merged":[[1,0,2,0],[1,1,2,1],[0,0,0,10]]}
[{"$f":"muni& \" - \"&S71Sa& \" - \"&Head57","v":"Choose name from list - Supporting Table SC13a Monthly Budget Statement - capital expenditure on new assets by asset class - Mid-Year Assessment"}]
[{"$f":"desc","v":"Description"},{"$f":"head27","v":"Ref"},{"$f":"Head1","v":"2019/20"},{"$f":"Head2","v":"Budget Year 2020/21"}]
[null,null,{"$f":"Head5","v":"Audited Outcome"},{"$f":"Head6","v":"Original Budget"},{"$f":"Head7","v":"Adjusted Budget"},{"$f":"Head38","v":"Monthly actual"},{"$f":"Head39","v":"YearTD actual"},{"$f":"Head40","v":"YearTD budget"},{"$f":"Head41","v":"YTD variance"},{"$f":"Head41","v":"YTD variance"},{"$f":"Head8","v":"Full Year Forecast"}]
["R thousands",1,null,null,null,null,null,null,null,"%"]
["Capital expenditure on new assets by Asset Class/Sub-class"]
[]
["Infrastructure",null,{"$f":"C8+C13+C17+C27+C38+C45+C53+C63+C69","v":71583669},9467783,17191768,2670098,17019808,7856016,{"$f":"H7-G7","v":-9163792},{"$f":"IF(I7=0,\"\",I7/H7)","v":-1.1664680927330087},{"$f":"K8+K13+K17+K27+K38+K45+K53+K63+K69","v":15712018}]
["Roads Infrastructure",null,{"$f":"SUM(C9:C12)","v":71583669},9467783,17191768,2670098,17019808,7856016,-9163792,-1.1664680927330087,{"$f":"SUM(K9:K12)","v":15712018}]
["Roads",null,71583669,9467783,17191768,2670098,17019808,7856016,-9163792,-1.1664680927330087,15712018]
["Road Structures",null,0,0,0,0,0,0,0,"",0]
["Road Furniture",null,0,0,0,0,0,0,0,"",0]
["Capital Spares",null,0,0,0,0,0,0,0,"",0]
["Storm water Infrastructure",null,{"$f":"SUM(C14:C16)","v":0},0,0,0,0,0,0,"",{"$f":"SUM(K14:K16)","v":0}]
["Drainage Collection",null,null,null,null,null,null,null,0,""]
["Storm water Conveyance",null,null,null,null,null,null,null,0,""]
["Attenuation",null,null,null,null,null,null,null,0,""]
["Electrical Infrastructure",null,{"$f":"SUM(C18:C26)","v":0},0,0,0,0,0,0,"",{"$f":"SUM(K18:K26)","v":0}]
["Power Plants",null,null,null,null,null,null,null,0,""]
["HV Substations",null,null,null,null,null,null,null,0,""]
["HV Switching Station",null,null,null,null,null,null,null,0,""]
["HV Transmission Conductors",null,null,null,null,null,null,null,0,""]
["MV Substations",null,null,null,null,null,null,null,0,""]
["MV Switching Stations",null,null,null,null,null,null,null,0,""]
["MV Networks",null,null,null,null,null,null,null,0,""]
["LV Networks",null,null,null,null,null,null,null,0,""]
["Capital Spares",null,null,null,null,null,null,null,0,""]
["Water Supply Infrastructure",null,{"$f":"SUM(C28:C37)","v":0},0,0,0,0,0,0,"",{"$f":"SUM(K28:K37)","v":0}]
["Dams and Weirs",null,null,null,null,null,null,null,0,""]
["Boreholes",null,null,null,null,null,null,null,0,""]
["Reservoirs",null,null,null,null,null,null,null,0,""]
["Pump Stations",null,null,null,null,null,null,null,0,""]
["Water Treatment Works",null,null,null,null,null,null,null,0,""]
["Bulk Mains",null,null,null,null,null,null,null,0,""]
["Distribution",null,null,null,null,null,null,null,0,""]
["Distribution Points",null,null,null,null,null,null,null,0,""]
["PRV Stations",null,null,null,null,null,null,null,0,""]
["Capital Spares",null,null,null,null,null,null,null,0,""]
["Sanitation Infrastructure",null,{"$f":"SUM(C39:C44)","v":0},0,0,0,0,0,{"$f":"H38-G38","v":0},{"$f":"IF(I38=0,\"\",I38/H38)","v":""},{"$f":"SUM(K39:K44)","v":0}]
["Pump Station",null,null,null,null,null,null,null,0,""]
["Reticulation",null,null,null,null,null,null,null,{"$f":"H40-G40","v":0},{"$f":"IF(I40=0,\"\",I40/H40)","v":""}]
["Waste Water Treatment Works",null,null,null,null,null,null,null,{"$f":"H41-G41","v":0},{"$f":"IF(I41=0,\"\",I41/H41)","v":""}]
["Outfall Sewers",null,null,null,null,null,null,null,{"$f":"H42-G42","v":0},{"$f":"IF(I42=0,\"\",I42/H42)","v":""}]
["Toilet Facilities",null,null,null,null,null,null,null,0,""]
["Capital Spares",null,null,null,null,null,null,null,0,""]
["Solid Waste Infrastructure",null,{"$f":"SUM(C46:C52)","v":0},0,0,0,0,0,{"$f":"H45-G45","v":0},{"$f":"IF(I45=0,\"\",I45/H45)","v":""},{"$f":"SUM(K46:K52)","v":0}]
["Landfill Sites",null,null,null,null,null,null,null,0,""]
["Waste Transfer Stations",null,null,null,null,null,null,null,0,""]
["Waste Processing Facilities",null,null,null,null,null,null,null,{"$f":"H48-G48","v":0},{"$f":"IF(I48=0,\"\",I48/H48)","v":""}]
["Waste Drop-off Points",null,null,null,null,null,null,null,0,""]
["Waste Separation Facilities",null,null,null,null,null,null,null,0,""]
["Electricity Generation Facilities",null,null,null,null,null,null,null,0,""]
["Capital Spares",null,null,null,null,null,null,null,0,""]
["Rail Infrastructure",null,{"$f":"SUM(C54:C62)","v":0},0,0,0,0,0,0,"",{"$f":"SUM(K54:K62)","v":0}]
["Rail Lines",null,null,null,null,null,null,null,0,""]
["Rail Structures",null,null,null,null,null,null,null,0,""]
["Rail Furniture",null,null,null,null,null,null,null,0,""]
["Drainage Collection",null,null,null,null,null,null,null,0,""]
["Storm water Conveyance",null,null,null,null,null,null,null,0,""]
["Attenuation",null,null,null,null,null,null,null,0,""]
["MV Substations",null,null,null,null,null,null,null,0,""]
["LV Networks",null,null,null,null,null,null,null,0,""]
["Capital Spares",null,null,null,null,null,null,null,0,""]
["Coastal Infrastructure",null,{"$f":"SUM(C64:C68)","v":0},0,0,0,0,0,0,"",{"$f":"SUM(K64:K68)","v":0}]
["Sand Pumps",null,null,null,null,null,null,null,0,""]
["Piers",null,null,null,null,null,null,null,0,""]
["Revetments",null,null,null,null,null,null,null,0,""]
["Promenades",null,null,null,null,null,null,null,0,""]
["Capital Spares",null,null,null,null,null,null,null,0,""]
["Information and Communication Infrastructure",null,{"$f":"SUM(C70:C73)","v":0},0,0,0,0,0,{"$f":"H69-G69","v":0},{"$f":"IF(I69=0,\"\",I69/H69)","v":""},{"$f":"SUM(K70:K73)","v":0}]
["Data Centres",null,null,null,null,null,null,null,{"$f":"H70-G70","v":0},""]
["Core Layers",null,null,null,null,null,null,null,{"$f":"H71-G71","v":0},""]
["Distribution Layers",null,null,null,null,null,null,null,{"$f":"H72-G72","v":0},""]
["Capital Spares",null,null,null,null,null,null,null,{"$f":"H73-G73","v":0},""]
[null,null,null,null,null,null,null,null,null,""]
["Community Assets",null,{"$f":"+C76+C99","v":108974942},9528984,9528984,289655,3387019,4764492,{"$f":"H75-G75","v":1377473},0.28911224953258396,{"$f":"+K76+K99","v":9528984}]
["Community Facilities",null,{"$f":"SUM(C77:C98)","v":108974942},9528984,9528984,289655,3387019,4764492,{"$f":"H76-G76","v":1377473},{"$f":"IF(I76=0,\"\",I76/H76)","v":0.28911224953258396},{"$f":"SUM(K77:K98)","v":9528984}]
["Halls",null,9335505,7990468,7990468,289655,2546341,3995232,1448891,0.36265503480148337,7990468]
["Centres",null,0,0,0,0,0,0,0,"",0]
["Crèches",null,99639437,1538516,1538516,0,840678,769260,-71418,-9.2839872084860775E-2,1538516]
["Clinics/Care Centres",null,null,null,null,null,null,null,0,""]
["Fire/Ambulance Stations",null,null,null,null,null,null,null,0,""]
["Testing Stations",null,null,null,null,null,null,null,0,""]
["Museums",null,null,null,null,null,null,null,0,""]
["Galleries",null,null,null,null,null,null,null,0,""]
["Theatres",null,null,null,null,null,null,null,0,""]
["Libraries",null,null,null,null,null,null,null,0,""]
["Cemeteries/Crematoria",null,null,null,null,null,null,null,0,""]
["Police",null,null,null,null,null,null,null,{"$f":"H88-G88","v":0},{"$f":"IF(I88=0,\"\",I88/H88)","v":""}]
["Purls",null,null,null,null,null,null,null,0,""]
["Public Open Space",null,null,null,null,null,null,null,0,""]
["Nature Reserves",null,null,null,null,null,null,null,0,""]
["Public Ablution Facilities",null,null,null,null,null,null,null,0,""]
["Markets",null,null,null,null,null,null,null,0,""]
["Stalls",null,null,null,null,null,null,null,0,""]
["Abattoirs",null,null,null,null,null,null,null,0,""]
["Airports",null,null,null,null,null,null,null,0,""]
["Taxi Ranks/Bus Terminals",null,null,null,null,null,null,null,0,""]
["Capital Spares",null,null,null,null,null,null,null,0,""]
["Sport and Recreation Facilities",null,{"$f":"SUM(C100:C102)","v":0},0,0,0,0,0,0,"",{"$f":"SUM(K100:K102)","v":0}]
["Indoor Facilities",null,null,null,null,null,null,null,0,""]
["Outdoor Facilities",null,null,null,null,null,null,null,0,""]
["Capital Spares",null,null,null,null,null,null,null,0,""]
["Heritage assets",null,{"$f":"SUM(C104:C108)","v":0},0,0,0,0,0,0,"",{"$f":"SUM(K104:K108)","v":0}]
["Monuments",null,null,null,null,null,null,null,0,""]
["Historic Buildings",null,null,null,null,null,null,null,0,""]
["Works of Art",null,null,null,null,null,null,null,0,""]
["Conservation Areas",null,null,null,null,null,null,null,0,""]
["Other Heritage",null,null,null,null,null,null,null,0,""]
[null,null,null,null,null,null,null,null,0,""]
["Investment properties",null,{"$f":"+C111+C114","v":0},0,0,0,0,0,0,"",{"$f":"+K111+K114","v":0}]
["Revenue Generating",null,{"$f":"SUM(C112:C113)","v":0},0,0,0,0,0,0,"",{"$f":"SUM(K112:K113)","v":0}]
["Improved Property",null,null,null,null,null,null,null,0,""]
["Unimproved Property",null,null,null,null,null,null,null,0,""]
["Non-revenue Generating",null,{"$f":"SUM(C115:C116)","v":0},0,0,0,0,0,0,"",{"$f":"SUM(K115:K116)","v":0}]
["Improved Property",null,null,null,null,null,null,null,0,""]
["Unimproved Property",null,null,null,null,null,null,null,0,""]
["Other assets",null,{"$f":"+C118+C130","v":13182084},5000000,5000000,1022301,1022301,2500002,1477701,0.59107992713605828,{"$f":"+K118+K130","v":4999999.9999999991}]
["Operational Buildings",null,{"$f":"SUM(C119:C129)","v":13182084},5000000,5000000,1022301,1022301,2500002,1477701,0.59107992713605828,{"$f":"SUM(K119:K129)","v":4999999.9999999991}]
["Municipal Offices",null,13182084,5000000,5000000,1022301,1022301,2500002,1477701,0.59107992713605828,4999999.9999999991]
["Pay/Enquiry Points",null,null,null,null,null,null,null,0,{"$f":"IF(I120=0,\"\",I120/H120)","v":""}]
["Building Plan Offices",null,null,null,null,null,null,null,0,""]
["Workshops",null,null,null,null,null,null,null,0,""]
["Yards",null,null,null,null,null,null,null,0,""]
["Stores",null,null,null,null,null,null,null,0,""]
["Laboratories",null,null,null,null,null,null,null,0,""]
["Training Centres",null,null,null,null,null,null,null,0,""]
["Manufacturing Plant",null,null,null,null,null,null,null,0,""]
["Depots",null,null,null,null,null,null,null,0,""]
["Capital Spares",null,null,null,null,null,null,null,0,""]
["Housing",null,{"$f":"SUM(C131:C133)","v":0},0,0,0,0,0,0,"",{"$f":"SUM(K131:K133)","v":0}]
["Staff Housing",null,null,null,null,null,null,null,0,""]
["Social Housing",null,null,null,null,null,null,null,0,""]
["Capital Spares",null,null,null,null,null,null,null,0,""]
[null,null,null,null,null,null,null,null,null,""]
["Biological or Cultivated Assets",null,{"$f":"SUM(C136:C136)","v":0},0,0,0,0,0,{"$f":"H135-G135","v":0},"",{"$f":"SUM(K136)","v":0}]
["Biological or Cultivated Assets",null,null,null,null,null,null,null,{"$f":"H136-G136","v":0},""]
[null,null,null,null,null,null,null,null,null,""]
["Intangible Assets",null,{"$f":"SUM(C139:C140)","v":1383449},0,0,0,0,0,{"$f":"H138-G138","v":0},"",{"$f":"SUM(K139:K140)","v":0}]
["Servitudes",null,null,null,null,null,null,null,0,""]
["Licences and Rights",null,{"$f":"SUM(C141:C146)","v":1383449},0,0,0,0,0,0,"",{"$f":"SUM(K141:K146)","v":0}]
["Water Rights",null,null,null,null,null,null,null,0,""]
["Effluent Licenses",null,null,null,null,null,null,null,0,""]
["Solid Waste Licenses",null,null,null,null,null,null,null,0,""]
["Computer Software and Applications",null,1383449,null,null,null,null,null,0,""]
["Load Settlement Software Applications",null,null,null,null,null,null,null,0,""]
["Unspecified",null,null,null,null,null,null,null,0,""]
[]
["Computer Equipment",null,{"$f":"SUM(C149:C149)","v":977996},300000,300000,0,92826,150000,{"$f":"H148-G148","v":57174},{"$f":"IF(I148=0,\"\",I148/H148)","v":0.38116},{"$f":"SUM(K149)","v":300000}]
["Computer Equipment",null,977996,300000,300000,0,92826,150000,{"$f":"H149-G149","v":57174},{"$f":"IF(I149=0,\"\",I149/H149)","v":0.38116},300000]
[]
["Furniture and Office Equipment",null,{"$f":"SUM(C152:C152)","v":5388998},400000,400000,48895,124785,199998,{"$f":"H151-G151","v":75213},{"$f":"IF(I151=0,\"\",I151/H151)","v":0.37606876068760686},{"$f":"SUM(K152)","v":400000}]
["Furniture and Office Equipment",null,5388998,400000,400000,48895,124785,199998,{"$f":"H152-G152","v":75213},{"$f":"IF(I152=0,\"\",I152/H152)","v":0.37606876068760686},400000]
[null,null,null,null,null,null,null,null,null,{"$f":"IF(I153=0,\"\",I153/H153)","v":""}]
["Machinery and Equipment",null,{"$f":"SUM(C155:C155)","v":0},0,0,0,0,0,{"$f":"H154-G154","v":0},{"$f":"IF(I154=0,\"\",I154/H154)","v":""},{"$f":"SUM(K155)","v":0}]
["Machinery and Equipment",null,null,null,null,null,null,null,{"$f":"H155-G155","v":0},{"$f":"IF(I155=0,\"\",I155/H155)","v":""}]
[]
["Transport Assets",null,{"$f":"SUM(C158:C158)","v":4779160},0,0,0,0,0,{"$f":"H157-G157","v":0},{"$f":"IF(I157=0,\"\",I157/H157)","v":""},{"$f":"SUM(K158)","v":0}]
["Transport Assets",null,4779160,null,null,null,null,null,{"$f":"H158-G158","v":0},{"$f":"IF(I158=0,\"\",I158/H158)","v":""}]
[]
["Land",null,{"$f":"SUM(C161:C161)","v":10405000},0,0,0,0,0,{"$f":"H160-G160","v":0},{"$f":"IF(I160=0,\"\",I160/H160)","v":""},{"$f":"SUM(K161)","v":0}]
["Land",null,10405000,null,null,null,null,null,{"$f":"H161-G161","v":0},{"$f":"IF(I161=0,\"\",I161/H161)","v":""}]
[]
["Zoo's, Marine and Non-biological Animals",null,{"$f":"SUM(C164:C164)","v":0},0,0,0,0,0,{"$f":"H163-G163","v":0},{"$f":"IF(I163=0,\"\",I163/H163)","v":""},{"$f":"SUM(K164)","v":0}]
["Zoo's, Marine and Non-biological Animals",null,null,null,null,null,null,null,{"$f":"H164-G164","v":0},{"$f":"IF(I164=0,\"\",I164/H164)","v":""}]
[null,null,null,null,null,null,null,null,null,{"$f":"IF(I165=0,\"\",I165/H165)","v":""}]
["Total Capital Expenditure on new assets",1,{"$f":"C7+C75+C103+C110+C117+C135+C138+C148+C151+C154+C157+C160+C163","v":216675298},24696767,32420752,4030949,21646739,15470508,{"$f":"H166-G166","v":-6176231},{"$f":"IF(I166=0,\"\",I166/H166)","v":-0.39922612754539155},{"$f":"K7+K75+K103+K110+K117+K135+K138+K148+K151+K154+K157+K160+K163","v":30941002}]
[]
[{"$f":"head27a","v":"References"}]
["1. Total Capital Expenditure on new assets (SC13a) plus Total Capital Expenditure on renewal of existing assets (SC13b) plus Total Capital Expenditure on upgrading of existing assets (SC13e)  must reconcile to total capital expenditure in Table C5"]
[]
["check balance",null,{"$f":"C166+SC13b!C166+SC13e!C166-'C5-Capex'!C40","v":5887005},{"$f":"D166+SC13b!D166+SC13e!D166-'C5-Capex'!D40","v":0},{"$f":"E166+SC13b!E166+SC13e!E166-'C5-Capex'!E40","v":0},{"$f":"F166+SC13b!F166+SC13e!F166-'C5-Capex'!F40","v":0},{"$f":"G166+SC13b!G166+SC13e!G166-'C5-Capex'!G40","v":0},{"$f":"H166+SC13b!H166+SC13e!H166-'C5-Capex'!H40","v":0},null,null,{"$f":"K166+SC13b!K166+SC13e!K166-'C5-Capex'!K40","v":1.3400000035762787}]

{"sheet":"SC13b","index":30,"n_rows":171,"n_cols":11,"rows_kept":171,"cut":false,"hidden":false,"merged":[[0,0,0,10],[1,0,2,0],[1,1,2,1]]}
[{"$f":"muni& \" - \"&S71Sb& \" - \"&Head57","v":"Choose name from list - Supporting Table SC13b Monthly Budget Statement - capital expenditure on renewal of existing assets by asset class - Mid-Year Assessment"}]
[{"$f":"desc","v":"Description"},{"$f":"head27","v":"Ref"},{"$f":"Head1","v":"2019/20"},{"$f":"Head2","v":"Budget Year 2020/21"}]
[null,null,{"$f":"Head5","v":"Audited Outcome"},{"$f":"Head6","v":"Original Budget"},{"$f":"Head7","v":"Adjusted Budget"},{"$f":"Head38","v":"Monthly actual"},{"$f":"Head39","v":"YearTD actual"},{"$f":"Head40","v":"YearTD budget"},{"$f":"Head41","v":"YTD variance"},{"$f":"Head41","v":"YTD variance"},{"$f":"Head8","v":"Full Year Forecast"}]
["R thousands",1,null,null,null,null,null,null,null,"%"]
["Capital expenditure on renewal of existing assets by Asset Class/Sub-class"]
[]
["Infrastructure",null,{"$f":"C8+C13+C17+C27+C38+C45+C53+C63+C69","v":0},0,0,0,0,0,{"$f":"H7-G7","v":0},{"$f":"IF(I7=0,\"\",I7/H7)","v":""},{"$f":"K8+K13+K17+K27+K38+K45+K53+K63+K69","v":0}]
["Roads Infrastructure",null,{"$f":"SUM(C9:C12)","v":0},0,0,0,0,0,0,"",{"$f":"SUM(K9:K12)","v":0}]
["Roads",null,null,null,null,null,null,null,0,""]
["Road Structures",null,null,null,null,null,null,null,0,""]
["Road Furniture",null,null,null,null,null,null,null,0,""]
["Capital Spares",null,null,null,null,null,null,null,0,""]
["Storm water Infrastructure",null,{"$f":"SUM(C14:C16)","v":0},0,0,0,0,0,0,"",{"$f":"SUM(K14:K16)","v":0}]
["Drainage Collection",null,null,null,null,null,null,null,0,""]
["Storm water Conveyance",null,null,null,null,null,null,null,0,""]
["Attenuation",null,null,null,null,null,null,null,0,""]
["Electrical Infrastructure",null,{"$f":"SUM(C18:C26)","v":0},0,0,0,0,0,0,"",{"$f":"SUM(K18:K26)","v":0}]
["Power Plants",null,null,null,null,null,null,null,0,""]
["HV Substations",null,null,null,null,null,null,null,0,""]
["HV Switching Station",null,null,null,null,null,null,null,0,""]
["HV Transmission Conductors",null,null,null,null,null,null,null,0,""]
["MV Substations",null,null,null,null,null,null,null,0,""]
["MV Switching Stations",null,null,null,null,null,null,null,0,""]
["MV Networks",null,null,null,null,null,null,null,0,""]
["LV Networks",null,null,null,null,null,null,null,0,""]
["Capital Spares",null,null,null,null,null,null,null,0,""]
["Water Supply Infrastructure",null,{"$f":"SUM(C28:C37)","v":0},0,0,0,0,0,0,"",{"$f":"SUM(K28:K37)","v":0}]
["Dams and Weirs",null,null,null,null,null,null,null,0,""]
["Boreholes",null,null,null,null,null,null,null,0,""]
["Reservoirs",null,null,null,null,null,null,null,0,""]
["Pump Stations",null,null,null,null,null,null,null,0,""]
["Water Treatment Works",null,null,null,null,null,null,null,0,""]
["Bulk Mains",null,null,null,null,null,null,null,0,""]
["Distribution",null,null,null,null,null,null,null,0,""]
["Distribution Points",null,null,null,null,null,null,null,0,""]
["PRV Stations",null,null,null,null,null,null,null,0,""]
["Capital Spares",null,null,null,null,null,null,null,0,""]
["Sanitation Infrastructure",null,{"$f":"SUM(C39:C44)","v":0},0,0,0,0,0,0,"",{"$f":"SUM(K39:K44)","v":0}]
["Pump Station",null,null,null,null,null,null,null,0,""]
["Reticulation",null,null,null,null,null,null,null,0,""]
["Waste Water Treatment Works",null,null,null,null,null,null,null,0,""]
["Outfall Sewers",null,null,null,null,null,null,null,0,""]
["Toilet Facilities",null,null,null,null,null,null,null,0,""]
["Capital Spares",null,null,null,null,null,null,null,0,""]
["Solid Waste Infrastructure",null,{"$f":"SUM(C46:C52)","v":0},0,0,0,0,0,0,"",{"$f":"SUM(K46:K52)","v":0}]
["Landfill Sites",null,null,null,null,null,null,null,0,""]
["Waste Transfer Stations",null,null,null,null,null,null,null,0,""]
["Waste Processing Facilities",null,null,null,null,null,null,null,0,""]
["Waste Drop-off Points",null,null,null,null,null,null,null,0,""]
["Waste Separation Facilities",null,null,null,null,null,null,null,0,""]
["Electricity Generation Facilities",null,null,null,null,null,null,null,0,""]
["Capital Spares",null,null,null,null,null,null,null,0,""]
["Rail Infrastructure",null,{"$f":"SUM(C54:C62)","v":0},0,0,0,0,0,0,"",{"$f":"SUM(K54:K62)","v":0}]
["Rail Lines",null,null,null,null,null,null,null,0,""]
["Rail Structures",null,null,null,null,null,null,null,0,""]
["Rail Furniture",null,null,null,null,null,null,null,0,""]
["Drainage Collection",null,null,null,null,null,null,null,0,""]
["Storm water Conveyance",null,null,null,null,null,null,null,0,""]
["Attenuation",null,null,null,null,null,null,null,0,""]
["MV Substations",null,null,null,null,null,null,null,0,""]
["LV Networks",null,null,null,null,null,null,null,0,""]
["Capital Spares",null,null,null,null,null,null,null,0,""]
["Coastal Infrastructure",null,{"$f":"SUM(C64:C68)","v":0},0,0,0,0,0,0,"",{"$f":"SUM(K64:K68)","v":0}]
["Sand Pumps",null,null,null,null,null,null,null,0,""]
["Piers",null,null,null,null,null,null,null,0,""]
["Revetments",null,null,null,null,null,null,null,0,""]
["Promenades",null,null,null,null,null,null,null,0,""]
["Capital Spares",null,null,null,null,null,null,null,0,""]
["Information and Communication Infrastructure",null,{"$f":"SUM(C70:C73)","v":0},0,0,0,0,0,0,"",{"$f":"SUM(K70:K73)","v":0}]
["Data Centres",null,null,null,null,null,null,null,0,""]
["Core Layers",null,null,null,null,null,null,null,0,""]
["Distribution Layers",null,null,null,null,null,null,null,0,""]
["Capital Spares",null,null,null,null,null,null,null,0,""]
[null,null,null,null,null,null,null,null,null,""]
["Community Assets",null,{"$f":"+C76+C99","v":0},0,0,0,0,0,0,"",{"$f":"+K76+K99","v":0}]
["Community Facilities",null,{"$f":"SUM(C77:C98)","v":0},0,0,0,0,0,0,"",{"$f":"SUM(K77:K98)","v":0}]
["Halls",null,null,null,null,null,null,null,0,""]
["Centres",null,null,null,null,null,null,null,0,""]
["Crèches",null,null,null,null,null,null,null,0,""]
["Clinics/Care Centres",null,null,null,null,null,null,null,0,""]
["Fire/Ambulance Stations",null,null,null,null,null,null,null,0,""]
["Testing Stations",null,null,null,null,null,null,null,0,""]
["Museums",null,null,null,null,null,null,null,0,""]
["Galleries",null,null,null,null,null,null,null,0,""]
["Theatres",null,null,null,null,null,null,null,0,""]
["Libraries",null,null,null,null,null,null,null,0,""]
["Cemeteries/Crematoria",null,null,null,null,null,null,null,0,""]
["Police",null,null,null,null,null,null,null,0,""]
["Purls",null,null,null,null,null,null,null,0,""]
["Public Open Space",null,null,null,null,null,null,null,0,""]
["Nature Reserves",null,null,null,null,null,null,null,0,""]
["Public Ablution Facilities",null,null,null,null,null,null,null,0,""]
["Markets",null,null,null,null,null,null,null,0,""]
["Stalls",null,null,null,null,null,null,null,0,""]
["Abattoirs",null,null,null,null,null,null,null,0,""]
["Airports",null,null,null,null,null,null,null,0,""]
["Taxi Ranks/Bus Terminals",null,null,null,null,null,null,null,0,""]
["Capital Spares",null,null,null,null,null,null,null,0,""]
["Sport and Recreation Facilities",null,{"$f":"SUM(C100:C102)","v":0},0,0,0,0,0,0,"",{"$f":"SUM(K100:K102)","v":0}]
["Indoor Facilities",null,null,null,null,null,null,null,0,""]
["Outdoor Facilities",null,null,null,null,null,null,null,{"$f":"H101-G101","v":0},{"$f":"IF(I101=0,\"\",I101/H101)","v":""}]
["Capital Spares",null,null,null,null,null,null,null,0,""]
["Heritage assets",null,{"$f":"SUM(C104:C108)","v":0},0,0,0,0,0,0,"",{"$f":"SUM(K104:K108)","v":0}]
["Monuments",null,null,null,null,null,null,null,0,""]
["Historic Buildings",null,null,null,null,null,null,null,0,""]
["Works of Art",null,null,null,null,null,null,null,0,""]
["Conservation Areas",null,null,null,null,null,null,null,0,""]
["Other Heritage",null,null,null,null,null,null,null,0,""]
[null,null,null,null,null,null,null,null,0,""]
["Investment properties",null,{"$f":"+C111+C114","v":0},0,0,0,0,0,0,"",{"$f":"+K111+K114","v":0}]
["Revenue Generating",null,{"$f":"SUM(C112:C113)","v":0},0,0,0,0,0,0,"",{"$f":"SUM(K112:K113)","v":0}]
["Improved Property",null,null,null,null,null,null,null,0,""]
["Unimproved Property",null,null,null,null,null,null,null,0,""]
["Non-revenue Generating",null,{"$f":"SUM(C115:C116)","v":0},0,0,0,0,0,0,"",{"$f":"SUM(K115:K116)","v":0}]
["Improved Property",null,null,null,null,null,null,null,0,""]
["Unimproved Property",null,null,null,null,null,null,null,{"$f":"H116-G116","v":0},{"$f":"IF(I116=0,\"\",I116/H116)","v":""}]
["Other assets",null,{"$f":"+C118+C130","v":0},0,0,0,0,0,0,"",{"$f":"+K118+K130","v":0}]
["Operational Buildings",null,{"$f":"SUM(C119:C129)","v":0},0,0,0,0,0,0,"",{"$f":"SUM(K119:K129)","v":0}]
["Municipal Offices",null,null,null,null,null,null,null,0,""]
["Pay/Enquiry Points",null,null,null,null,null,null,null,0,""]
["Building Plan Offices",null,null,null,null,null,null,null,0,""]
["Workshops",null,null,null,null,null,null,null,0,""]
["Yards",null,null,null,null,null,null,null,0,""]
["Stores",null,null,null,null,null,null,null,0,""]
["Laboratories",null,null,null,null,null,null,null,0,""]
["Training Centres",null,null,null,null,null,null,null,0,""]
["Manufacturing Plant",null,null,null,null,null,null,null,0,""]
["Depots",null,null,null,null,null,null,null,0,""]
["Capital Spares",null,null,null,null,null,null,null,0,""]
["Housing",null,{"$f":"SUM(C131:C133)","v":0},0,0,0,0,0,0,"",{"$f":"SUM(K131:K133)","v":0}]
["Staff Housing",null,null,null,null,null,null,null,0,""]
["Social Housing",null,null,null,null,null,null,null,0,""]
["Capital Spares",null,null,null,null,null,null,null,0,""]
[null,null,null,null,null,null,null,null,null,""]
["Biological or Cultivated Assets",null,{"$f":"SUM(C136:C136)","v":0},0,0,0,0,0,{"$f":"H135-G135","v":0},"",{"$f":"SUM(K136)","v":0}]
["Biological or Cultivated Assets",null,null,null,null,null,null,null,{"$f":"H136-G136","v":0},""]
[null,null,null,null,null,null,null,null,null,{"$f":"IF(I137=0,\"\",I137/H137)","v":""}]
["Intangible Assets",null,{"$f":"SUM(C139:C140)","v":0},0,0,0,0,0,{"$f":"H138-G138","v":0},"",{"$f":"SUM(K139:K140)","v":0}]
["Servitudes",null,null,null,null,null,null,null,0,""]
["Licences and Rights",null,{"$f":"SUM(C141:C146)","v":0},0,0,0,0,0,0,"",{"$f":"SUM(K141:K146)","v":0}]
["Water Rights",null,null,null,null,null,null,null,0,""]
["Effluent Licenses",null,null,null,null,null,null,null,0,""]
["Solid Waste Licenses",null,null,null,null,null,null,null,0,""]
["Computer Software and Applications",null,null,null,null,null,null,null,0,""]
["Load Settlement Software Applications",null,null,null,null,null,null,null,0,""]
["Unspecified",null,null,null,null,null,null,null,0,""]
[]
["Computer Equipment",null,{"$f":"SUM(C149:C149)","v":0},0,0,0,0,0,{"$f":"H148-G148","v":0},{"$f":"IF(I148=0,\"\",I148/H148)","v":""},{"$f":"SUM(K149)","v":0}]
["Computer Equipment",null,null,null,null,null,null,null,{"$f":"H149-G149","v":0},{"$f":"IF(I149=0,\"\",I149/H149)","v":""}]
[]
["Furniture and Office Equipment",null,{"$f":"SUM(C152:C152)","v":0},0,0,0,0,0,{"$f":"H151-G151","v":0},{"$f":"IF(I151=0,\"\",I151/H151)","v":""},{"$f":"SUM(K152)","v":0}]
["Furniture and Office Equipment",null,null,null,null,null,null,null,{"$f":"H152-G152","v":0},{"$f":"IF(I152=0,\"\",I152/H152)","v":""}]
[null,null,null,null,null,null,null,null,null,{"$f":"IF(I153=0,\"\",I153/H153)","v":""}]
["Machinery and Equipment",null,{"$f":"SUM(C155:C155)","v":0},0,0,0,0,0,{"$f":"H154-G154","v":0},{"$f":"IF(I154=0,\"\",I154/H154)","v":""},{"$f":"SUM(K155)","v":0}]
["Machinery and Equipment",null,null,null,null,null,null,null,{"$f":"H155-G155","v":0},{"$f":"IF(I155=0,\"\",I155/H155)","v":""}]
[]
["Transport Assets",null,{"$f":"SUM(C158:C158)","v":0},0,0,0,0,0,{"$f":"H157-G157","v":0},{"$f":"IF(I157=0,\"\",I157/H157)","v":""},{"$f":"SUM(K158)","v":0}]
["Transport Assets",null,null,null,null,null,null,null,{"$f":"H158-G158","v":0},{"$f":"IF(I158=0,\"\",I158/H158)","v":""}]
[]
["Land",null,{"$f":"SUM(C161:C161)","v":0},0,0,0,0,0,{"$f":"H160-G160","v":0},{"$f":"IF(I160=0,\"\",I160/H160)","v":""},{"$f":"SUM(K161)","v":0}]
["Land",null,null,null,null,null,null,null,{"$f":"H161-G161","v":0},{"$f":"IF(I161=0,\"\",I161/H161)","v":""}]
[null,null,null,null,null,null,null,null,null,"."]
["Zoo's, Marine and Non-biological Animals",null,{"$f":"SUM(C164:C164)","v":0},0,0,0,0,0,{"$f":"H163-G163","v":0},{"$f":"IF(I163=0,\"\",I163/H163)","v":""},{"$f":"SUM(K164)","v":0}]
["Zoo's, Marine and Non-biological Animals",null,null,null,null,null,null,null,{"$f":"H164-G164","v":0},{"$f":"IF(I164=0,\"\",I164/H164)","v":""}]
[null,null,null,null,null,null,null,null,null,{"$f":"IF(I165=0,\"\",I165/H165)","v":""}]
["Total Capital Expenditure on renewal of existing assets ",1,{"$f":"C7+C75+C103+C110+C117+C135+C138+C148+C151+C154+C157+C160+C163","v":0},0,0,0,0,0,{"$f":"H166-G166","v":0},{"$f":"IF(I166=0,\"\",I166/H166)","v":""},{"$f":"K7+K75+K103+K110+K117+K135+K138+K148+K151+K154+K157+K160+K163","v":0}]
[]
[{"$f":"head27a","v":"References"}]
["1. Total Capital Expenditure on new assets (SC13a) plus Total Capital Expenditure on renewal of existing assets (SC13b) plus Total Capital Expenditure on upgrading of existing assets (SC13e) must reconcile to total capital expenditure in Table C5"]
[]
["check balance",null,{"$f":"C166+SC13a!C166+SC13e!C166-'C5-Capex'!C40","v":5887005},{"$f":"D166+SC13a!D166+SC13e!D166-'C5-Capex'!D40","v":0},{"$f":"E166+SC13a!E166+SC13e!E166-'C5-Capex'!E40","v":0},{"$f":"F166+SC13a!F166+SC13e!F166-'C5-Capex'!F40","v":0},{"$f":"G166+SC13a!G166+SC13e!G166-'C5-Capex'!G40","v":0},{"$f":"H166+SC13a!H166+SC13e!H166-'C5-Capex'!H40","v":0},null,null,{"$f":"K166+SC13a!K166+SC13e!K166-'C5-Capex'!K40","v":1.3400000035762787}]

{"sheet":"SC13c","index":31,"n_rows":166,"n_cols":11,"rows_kept":166,"cut":false,"hidden":false,"merged":[[0,0,0,10],[1,0,2,0],[1,1,2,1]]}
[{"$f":"muni& \" - \"&S71Sc& \" - \"&Head57","v":"Choose name from list - Supporting Table SC13c Monthly Budget Statement - expenditure on repairs and maintenance by asset class - Mid-Year Assessment"}]
[{"$f":"desc","v":"Description"},{"$f":"head27","v":"Ref"},{"$f":"Head1","v":"2019/20"},{"$f":"Head2","v":"Budget Year 2020/21"}]
[null,null,{"$f":"Head5","v":"Audited Outcome"},{"$f":"Head6","v":"Original Budget"},{"$f":"Head7","v":"Adjusted Budget"},{"$f":"Head38","v":"Monthly actual"},{"$f":"Head39","v":"YearTD actual"},{"$f":"Head40","v":"YearTD budget"},{"$f":"Head41","v":"YTD variance"},{"$f":"Head41","v":"YTD variance"},{"$f":"Head8","v":"Full Year Forecast"}]
["R thousands",1,null,null,null,null,null,null,null,"%"]
["Repairs and maintenance expenditure by Asset Class/Sub-class"]
[]
["Infrastructure",null,{"$f":"C8+C13+C17+C27+C38+C45+C53+C63+C69","v":1568075},11000000,11000000,0,13633816,5500002,{"$f":"H7-G7","v":-8133814},{"$f":"IF(I7=0,\"\",I7/H7)","v":-1.4788747349546418},{"$f":"K8+K13+K17+K27+K38+K45+K53+K63+K69","v":11000000}]
["Roads Infrastructure",null,{"$f":"SUM(C9:C12)","v":1568075},11000000,11000000,0,13633816,5500002,-8133814,-1.4788747349546418,{"$f":"SUM(K9:K12)","v":11000000}]
["Roads",null,0,9000000,9000000,0,11268512,4500000,-6768512,-1.5041137777777778,9000000]
["Road Structures",null,1568075,2000000,2000000,0,2365304,1000002,-1365302,-1.3652992694014612,1999999.9999999998]
["Road Furniture",null,0,0,0,0,0,0,0,"",0]
["Capital Spares",null,0,0,0,0,0,0,0,"",0]
["Storm water Infrastructure",null,{"$f":"SUM(C14:C16)","v":0},0,0,0,0,0,0,"",{"$f":"SUM(K14:K16)","v":0}]
["Drainage Collection",null,null,null,null,null,null,null,0,""]
["Storm water Conveyance",null,null,null,null,null,null,null,0,""]
["Attenuation",null,null,null,null,null,null,null,0,""]
["Electrical Infrastructure",null,{"$f":"SUM(C18:C26)","v":0},0,0,0,0,0,0,"",{"$f":"SUM(K18:K26)","v":0}]
["Power Plants",null,null,null,null,null,null,null,0,""]
["HV Substations",null,null,null,null,null,null,null,0,""]
["HV Switching Station",null,null,null,null,null,null,null,0,""]
["HV Transmission Conductors",null,null,null,null,null,null,null,0,""]
["MV Substations",null,null,null,null,null,null,null,0,""]
["MV Switching Stations",null,null,null,null,null,null,null,0,""]
["MV Networks",null,null,null,null,null,null,null,0,""]
["LV Networks",null,null,null,null,null,null,null,0,""]
["Capital Spares",null,null,null,null,null,null,null,0,""]
["Water Supply Infrastructure",null,{"$f":"SUM(C28:C37)","v":0},0,0,0,0,0,0,"",{"$f":"SUM(K28:K37)","v":0}]
["Dams and Weirs",null,null,null,null,null,null,null,0,""]
["Boreholes",null,null,null,null,null,null,null,0,""]
["Reservoirs",null,null,null,null,null,null,null,0,""]
["Pump Stations",null,null,null,null,null,null,null,0,""]
["Water Treatment Works",null,null,null,null,null,null,null,0,""]
["Bulk Mains",null,null,null,null,null,null,null,0,""]
["Distribution",null,null,null,null,null,null,null,0,""]
["Distribution Points",null,null,null,null,null,null,null,0,""]
["PRV Stations",null,null,null,null,null,null,null,0,""]
["Capital Spares",null,null,null,null,null,null,null,0,""]
["Sanitation Infrastructure",null,{"$f":"SUM(C39:C44)","v":0},0,0,0,0,0,0,"",{"$f":"SUM(K39:K44)","v":0}]
["Pump Station",null,null,null,null,null,null,null,0,""]
["Reticulation",null,null,null,null,null,null,null,0,""]
["Waste Water Treatment Works",null,null,null,null,null,null,null,0,""]
["Outfall Sewers",null,null,null,null,null,null,null,0,""]
["Toilet Facilities",null,null,null,null,null,null,null,0,""]
["Capital Spares",null,null,null,null,null,null,null,0,""]
["Solid Waste Infrastructure",null,{"$f":"SUM(C46:C52)","v":0},0,0,0,0,0,0,"",{"$f":"SUM(K46:K52)","v":0}]
["Landfill Sites",null,null,null,null,null,null,null,0,""]
["Waste Transfer Stations",null,null,null,null,null,null,null,0,""]
["Waste Processing Facilities",null,null,null,null,null,null,null,0,""]
["Waste Drop-off Points",null,null,null,null,null,null,null,0,""]
["Waste Separation Facilities",null,null,null,null,null,null,null,0,""]
["Electricity Generation Facilities",null,null,null,null,null,null,null,0,""]
["Capital Spares",null,null,null,null,null,null,null,0,""]
["Rail Infrastructure",null,{"$f":"SUM(C54:C62)","v":0},0,0,0,0,0,0,"",{"$f":"SUM(K54:K62)","v":0}]
["Rail Lines",null,null,null,null,null,null,null,0,""]
["Rail Structures",null,null,null,null,null,null,null,0,""]
["Rail Furniture",null,null,null,null,null,null,null,0,""]
["Drainage Collection",null,null,null,null,null,null,null,0,""]
["Storm water Conveyance",null,null,null,null,null,null,null,0,""]
["Attenuation",null,null,null,null,null,null,null,0,""]
["MV Substations",null,null,null,null,null,null,null,0,""]
["LV Networks",null,null,null,null,null,null,null,0,""]
["Capital Spares",null,null,null,null,null,null,null,0,""]
["Coastal Infrastructure",null,{"$f":"SUM(C64:C68)","v":0},0,0,0,0,0,0,"",{"$f":"SUM(K64:K68)","v":0}]
["Sand Pumps",null,null,null,null,null,null,null,0,""]
["Piers",null,null,null,null,null,null,null,0,""]
["Revetments",null,null,null,null,null,null,null,0,""]
["Promenades",null,null,null,null,null,null,null,0,""]
["Capital Spares",null,null,null,null,null,null,null,0,""]
["Information and Communication Infrastructure",null,{"$f":"SUM(C70:C73)","v":0},0,0,0,0,0,0,"",{"$f":"SUM(K70:K73)","v":0}]
["Data Centres",null,null,null,null,null,null,null,0,""]
["Core Layers",null,null,null,null,null,null,null,0,""]
["Distribution Layers",null,null,null,null,null,null,null,0,""]
["Capital Spares",null,null,null,null,null,null,null,0,""]
[null,null,null,null,null,null,null,null,null,""]
["Community Assets",null,{"$f":"+C76+C99","v":5083670},3500000,3500000,158951,1117298,1750002,632704,0.36154472966316609,{"$f":"+K76+K99","v":3500000}]
["Community Facilities",null,{"$f":"SUM(C77:C98)","v":1950906},2000000,2000000,158951,679115,1000002,320887,0.32088635822728356,{"$f":"SUM(K77:K98)","v":2000000}]
["Halls",null,1699102,2000000,2000000,158951,679115,1000002,320887,0.32088635822728356,2000000]
["Centres",null,0,0,0,0,0,0,0,""]
["Crèches",null,251804,0,0,0,0,0,0,""]
["Clinics/Care Centres",null,null,null,null,null,null,null,0,""]
["Fire/Ambulance Stations",null,null,null,null,null,null,null,0,""]
["Testing Stations",null,null,null,null,null,null,null,0,""]
["Museums",null,null,null,null,null,null,null,0,""]
["Galleries",null,null,null,null,null,null,null,0,""]
["Theatres",null,null,null,null,null,null,null,0,""]
["Libraries",null,null,null,null,null,null,null,0,""]
["Cemeteries/Crematoria",null,null,null,null,null,null,null,0,""]
["Police",null,null,null,null,null,null,null,0,""]
["Purls",null,null,null,null,null,null,null,0,""]
["Public Open Space",null,null,null,null,null,null,null,0,""]
["Nature Reserves",null,null,null,null,null,null,null,0,""]
["Public Ablution Facilities",null,null,null,null,null,null,null,0,""]
["Markets",null,null,null,null,null,null,null,0,""]
["Stalls",null,null,null,null,null,null,null,0,""]
["Abattoirs",null,null,null,null,null,null,null,0,""]
["Airports",null,null,null,null,null,null,null,0,""]
["Taxi Ranks/Bus Terminals",null,null,null,null,null,null,null,0,""]
["Capital Spares",null,null,null,null,null,null,null,0,""]
["Sport and Recreation Facilities",null,{"$f":"SUM(C100:C102)","v":3132764},1500000,1500000,0,438183,750000,311817,0.41575600000000001,{"$f":"SUM(K100:K102)","v":1500000}]
["Indoor Facilities",null,null,null,null,null,null,null,0,""]
["Outdoor Facilities",null,3132764,1500000,1500000,0,438183,750000,{"$f":"H101-G101","v":311817},{"$f":"IF(I101=0,\"\",I101/H101)","v":0.41575600000000001},1500000]
["Capital Spares",null,null,null,null,null,null,null,0,""]
["Heritage assets",null,{"$f":"SUM(C104:C108)","v":0},0,0,0,0,0,0,"",{"$f":"SUM(K104:K108)","v":0}]
["Monuments",null,null,null,null,null,null,null,0,""]
["Historic Buildings",null,null,null,null,null,null,null,0,""]
["Works of Art",null,null,null,null,null,null,null,0,""]
["Conservation Areas",null,null,null,null,null,null,null,0,""]
["Other Heritage",null,null,null,null,null,null,null,0,""]
[null,null,null,null,null,null,null,null,0,""]
["Investment properties",null,{"$f":"+C111+C114","v":0},0,0,0,0,0,0,"",{"$f":"+K111+K114","v":0}]
["Revenue Generating",null,{"$f":"SUM(C112:C113)","v":0},0,0,0,0,0,0,"",{"$f":"SUM(K112:K113)","v":0}]
["Improved Property",null,null,null,null,null,null,null,0,""]
["Unimproved Property",null,null,null,null,null,null,null,0,""]
["Non-revenue Generating",null,{"$f":"SUM(C115:C116)","v":0},0,0,0,0,0,0,"",{"$f":"SUM(K115:K116)","v":0}]
["Improved Property",null,null,null,null,null,null,null,0,""]
["Unimproved Property",null,null,null,null,null,null,null,{"$f":"H116-G116","v":0},{"$f":"IF(I116=0,\"\",I116/H116)","v":""}]
["Other assets",null,{"$f":"+C118+C130","v":1064569},2000000,2000000,0,492491,1000002,507511,0.50750998498003008,{"$f":"+K118+K130","v":1999999.9999999998}]
["Operational Buildings",null,{"$f":"SUM(C119:C129)","v":1064569},2000000,2000000,0,492491,1000002,507511,0.50750998498003008,{"$f":"SUM(K119:K129)","v":1999999.9999999998}]
["Municipal Offices",null,1064569,2000000,2000000,0,492491,1000002,507511,0.50750998498003008,1999999.9999999998]
["Pay/Enquiry Points",null,null,null,null,null,null,null,0,""]
["Building Plan Offices",null,null,null,null,null,null,null,0,""]
["Workshops",null,null,null,null,null,null,null,0,""]
["Yards",null,null,null,null,null,null,null,0,""]
["Stores",null,null,null,null,null,null,null,0,""]
["Laboratories",null,null,null,null,null,null,null,0,""]
["Training Centres",null,null,null,null,null,null,null,0,""]
["Manufacturing Plant",null,null,null,null,null,null,null,0,""]
["Depots",null,null,null,null,null,null,null,0,""]
["Capital Spares",null,null,null,null,null,null,null,0,""]
["Housing",null,{"$f":"SUM(C131:C133)","v":0},0,0,0,0,0,0,"",{"$f":"SUM(K131:K133)","v":0}]
["Staff Housing",null,null,null,null,null,null,null,0,""]
["Social Housing",null,null,null,null,null,null,null,0,""]
["Capital Spares",null,null,null,null,null,null,null,0,""]
[null,null,null,null,null,null,null,null,null,""]
["Biological or Cultivated Assets",null,{"$f":"SUM(C136:C136)","v":0},0,0,0,0,0,{"$f":"H135-G135","v":0},"",{"$f":"SUM(K136)","v":0}]
["Biological or Cultivated Assets",null,null,null,null,null,null,null,{"$f":"H136-G136","v":0},""]
[null,null,null,null,null,null,null,null,null,{"$f":"IF(I137=0,\"\",I137/H137)","v":""}]
["Intangible Assets",null,{"$f":"SUM(C139:C140)","v":0},0,0,0,0,0,{"$f":"H138-G138","v":0},"",{"$f":"SUM(K139:K140)","v":0}]
["Servitudes",null,null,null,null,null,null,null,0,""]
["Licences and Rights",null,{"$f":"SUM(C141:C146)","v":0},0,0,0,0,0,0,"",{"$f":"SUM(K141:K146)","v":0}]
["Water Rights",null,null,null,null,null,null,null,0,""]
["Effluent Licenses",null,null,null,null,null,null,null,0,""]
["Solid Waste Licenses",null,null,null,null,null,null,null,0,""]
["Computer Software and Applications",null,null,null,null,null,null,null,0,""]
["Load Settlement Software Applications",null,null,null,null,null,null,null,0,""]
["Unspecified",null,null,null,null,null,null,null,0,""]
[]
["Computer Equipment",null,{"$f":"SUM(C149:C149)","v":0},0,0,0,0,0,{"$f":"H148-G148","v":0},{"$f":"IF(I148=0,\"\",I148/H148)","v":""},{"$f":"SUM(K149)","v":0}]
["Computer Equipment",null,null,null,null,null,null,null,{"$f":"H149-G149","v":0},{"$f":"IF(I149=0,\"\",I149/H149)","v":""}]
[]
["Furniture and Office Equipment",null,{"$f":"SUM(C152:C152)","v":0},0,0,0,0,0,{"$f":"H151-G151","v":0},{"$f":"IF(I151=0,\"\",I151/H151)","v":""},{"$f":"SUM(K152)","v":0}]
["Furniture and Office Equipment",null,null,null,null,null,null,null,{"$f":"H152-G152","v":0},{"$f":"IF(I152=0,\"\",I152/H152)","v":""}]
[null,null,null,null,null,null,null,null,null,{"$f":"IF(I153=0,\"\",I153/H153)","v":""}]
["Machinery and Equipment",null,{"$f":"SUM(C155:C155)","v":0},0,0,0,0,0,{"$f":"H154-G154","v":0},{"$f":"IF(I154=0,\"\",I154/H154)","v":""},{"$f":"SUM(K155)","v":0}]
["Machinery and Equipment",null,null,null,null,null,null,null,{"$f":"H155-G155","v":0},{"$f":"IF(I155=0,\"\",I155/H155)","v":""}]
[]
["Transport Assets",null,{"$f":"SUM(C158:C158)","v":599761},380000,380000,21340,574288,190002,{"$f":"H157-G157","v":-384286},{"$f":"IF(I157=0,\"\",I157/H157)","v":-2.0225366048778435},{"$f":"SUM(K158)","v":380000}]
["Transport Assets",null,599761,380000,380000,21340,574288,190002,{"$f":"H158-G158","v":-384286},{"$f":"IF(I158=0,\"\",I158/H158)","v":-2.0225366048778435},380000]
[]
["Land",null,{"$f":"SUM(C161:C161)","v":0},0,0,0,0,0,{"$f":"H160-G160","v":0},{"$f":"IF(I160=0,\"\",I160/H160)","v":""},{"$f":"SUM(K161)","v":0}]
["Land",null,null,null,null,null,null,null,{"$f":"H161-G161","v":0},{"$f":"IF(I161=0,\"\",I161/H161)","v":""}]
[]
["Zoo's, Marine and Non-biological Animals",null,{"$f":"SUM(C164:C164)","v":0},0,0,0,0,0,{"$f":"H163-G163","v":0},{"$f":"IF(I163=0,\"\",I163/H163)","v":""},{"$f":"SUM(K164)","v":0}]
["Zoo's, Marine and Non-biological Animals",null,null,null,null,null,null,null,{"$f":"H164-G164","v":0},{"$f":"IF(I164=0,\"\",I164/H164)","v":""}]
[null,null,null,null,null,null,null,null,null,{"$f":"IF(I165=0,\"\",I165/H165)","v":""}]
["Total Repairs and Maintenance Expenditure",1,{"$f":"C7+C75+C103+C110+C117+C135+C138+C148+C151+C154+C157+C160+C163","v":8316075},16880000,16880000,180291,15817893,8440008,-7377885,-0.87415616193728729,{"$f":"K7+K75+K103+K110+K117+K135+K138+K148+K151+K154+K157+K160+K163","v":16880000}]

{"sheet":"SC13d","index":32,"n_rows":166,"n_cols":11,"rows_kept":166,"cut":false,"hidden":false,"merged":[[0,0,0,10],[1,0,2,0],[1,1,2,1]]}
[{"$f":"muni& \" - \"&S71Sd& \" - \"&Head57","v":"Choose name from list - Supporting Table SC13d Monthly Budget Statement - depreciation by asset class - Mid-Year Assessment"}]
[{"$f":"desc","v":"Description"},{"$f":"head27","v":"Ref"},{"$f":"Head1","v":"2019/20"},{"$f":"Head2","v":"Budget Year 2020/21"}]
[null,null,{"$f":"Head5","v":"Audited Outcome"},{"$f":"Head6","v":"Original Budget"},{"$f":"Head7","v":"Adjusted Budget"},{"$f":"Head38","v":"Monthly actual"},{"$f":"Head39","v":"YearTD actual"},{"$f":"Head40","v":"YearTD budget"},{"$f":"Head41","v":"YTD variance"},{"$f":"Head41","v":"YTD variance"},{"$f":"Head8","v":"Full Year Forecast"}]
["R thousands",1,null,null,null,null,null,null,null,"%"]
["Depreciation by Asset Class/Sub-class"]
[]
["Infrastructure",null,{"$f":"C8+C13+C17+C27+C38+C45+C53+C63+C69","v":3574823},3787600,3787600,310638,1843786,1893798,{"$f":"H7-G7","v":50012},{"$f":"IF(I7=0,\"\",I7/H7)","v":2.6408307538607602E-2},{"$f":"K8+K13+K17+K27+K38+K45+K53+K63+K69","v":3787600}]
["Roads Infrastructure",null,{"$f":"SUM(C9:C12)","v":3574823},3787600,3787600,310638,1843786,1893798,50012,2.6408307538607602E-2,{"$f":"SUM(K9:K12)","v":3787600}]
["Roads",null,3574823,3787600,3787600,310638,1843786,1893798,50012,2.6408307538607602E-2,3787600]
["Road Structures",null,null,null,null,null,null,null,0,""]
["Road Furniture",null,null,null,null,null,null,null,0,""]
["Capital Spares",null,null,null,null,null,null,null,0,""]
["Storm water Infrastructure",null,{"$f":"SUM(C14:C16)","v":0},0,0,0,0,0,0,"",{"$f":"SUM(K14:K16)","v":0}]
["Drainage Collection",null,null,null,null,null,null,null,0,""]
["Storm water Conveyance",null,null,null,null,null,null,null,0,""]
["Attenuation",null,null,null,null,null,null,null,0,""]
["Electrical Infrastructure",null,{"$f":"SUM(C18:C26)","v":0},0,0,0,0,0,0,"",{"$f":"SUM(K18:K26)","v":0}]
["Power Plants",null,null,null,null,null,null,null,0,""]
["HV Substations",null,null,null,null,null,null,null,0,""]
["HV Switching Station",null,null,null,null,null,null,null,0,""]
["HV Transmission Conductors",null,null,null,null,null,null,null,0,""]
["MV Substations",null,null,null,null,null,null,null,0,""]
["MV Switching Stations",null,null,null,null,null,null,null,0,""]
["MV Networks",null,null,null,null,null,null,null,0,""]
["LV Networks",null,null,null,null,null,null,null,0,""]
["Capital Spares",null,null,null,null,null,null,null,0,""]
["Water Supply Infrastructure",null,{"$f":"SUM(C28:C37)","v":0},0,0,0,0,0,0,"",{"$f":"SUM(K28:K37)","v":0}]
["Dams and Weirs",null,null,null,null,null,null,null,0,""]
["Boreholes",null,null,null,null,null,null,null,0,""]
["Reservoirs",null,null,null,null,null,null,null,0,""]
["Pump Stations",null,null,null,null,null,null,null,0,""]
["Water Treatment Works",null,null,null,null,null,null,null,0,""]
["Bulk Mains",null,null,null,null,null,null,null,0,""]
["Distribution",null,null,null,null,null,null,null,0,""]
["Distribution Points",null,null,null,null,null,null,null,0,""]
["PRV Stations",null,null,null,null,null,null,null,0,""]
["Capital Spares",null,null,null,null,null,null,null,0,""]
["Sanitation Infrastructure",null,{"$f":"SUM(C39:C44)","v":0},0,0,0,0,0,0,"",{"$f":"SUM(K39:K44)","v":0}]
["Pump Station",null,null,null,null,null,null,null,0,""]
["Reticulation",null,null,null,null,null,null,null,0,""]
["Waste Water Treatment Works",null,null,null,null,null,null,null,0,""]
["Outfall Sewers",null,null,null,null,null,null,null,0,""]
["Toilet Facilities",null,null,null,null,null,null,null,0,""]
["Capital Spares",null,null,null,null,null,null,null,0,""]
["Solid Waste Infrastructure",null,{"$f":"SUM(C46:C52)","v":0},0,0,0,0,0,0,"",{"$f":"SUM(K46:K52)","v":0}]
["Landfill Sites",null,null,null,null,null,null,null,0,""]
["Waste Transfer Stations",null,null,null,null,null,null,null,0,""]
["Waste Processing Facilities",null,null,null,null,null,null,null,0,""]
["Waste Drop-off Points",null,null,null,null,null,null,null,0,""]
["Waste Separation Facilities",null,null,null,null,null,null,null,0,""]
["Electricity Generation Facilities",null,null,null,null,null,null,null,0,""]
["Capital Spares",null,null,null,null,null,null,null,0,""]
["Rail Infrastructure",null,{"$f":"SUM(C54:C62)","v":0},0,0,0,0,0,0,"",{"$f":"SUM(K54:K62)","v":0}]
["Rail Lines",null,null,null,null,null,null,null,0,""]
["Rail Structures",null,null,null,null,null,null,null,0,""]
["Rail Furniture",null,null,null,null,null,null,null,0,""]
["Drainage Collection",null,null,null,null,null,null,null,0,""]
["Storm water Conveyance",null,null,null,null,null,null,null,0,""]
["Attenuation",null,null,null,null,null,null,null,0,""]
["MV Substations",null,null,null,null,null,null,null,0,""]
["LV Networks",null,null,null,null,null,null,null,0,""]
["Capital Spares",null,null,null,null,null,null,null,0,""]
["Coastal Infrastructure",null,{"$f":"SUM(C64:C68)","v":0},0,0,0,0,0,0,"",{"$f":"SUM(K64:K68)","v":0}]
["Sand Pumps",null,null,null,null,null,null,null,0,""]
["Piers",null,null,null,null,null,null,null,0,""]
["Revetments",null,null,null,null,null,null,null,0,""]
["Promenades",null,null,null,null,null,null,null,0,""]
["Capital Spares",null,null,null,null,null,null,null,0,""]
["Information and Communication Infrastructure",null,{"$f":"SUM(C70:C73)","v":0},0,0,0,0,0,0,"",{"$f":"SUM(K70:K73)","v":0}]
["Data Centres",null,null,null,null,null,null,null,0,""]
["Core Layers",null,null,null,null,null,null,null,0,""]
["Distribution Layers",null,null,null,null,null,null,null,0,""]
["Capital Spares",null,null,null,null,null,null,null,0,""]
[null,null,null,null,null,null,null,null,null,""]
["Community Assets",null,{"$f":"+C76+C99","v":3916490},3787600,3787600,334222,1983768,1893798,-89970,-4.7507706735354031E-2,{"$f":"+K76+K99","v":3787600}]
["Community Facilities",null,{"$f":"SUM(C77:C98)","v":3916490},3787600,3787600,334222,1983768,1893798,-89970,-4.7507706735354031E-2,{"$f":"SUM(K77:K98)","v":3787600}]
["Halls",null,3916490,3787600,3787600,334222,1983768,1893798,-89970,-4.7507706735354031E-2,3787600]
["Centres",null,null,null,null,null,null,null,0,""]
["Crèches",null,null,null,null,null,null,null,0,""]
["Clinics/Care Centres",null,null,null,null,null,null,null,0,""]
["Fire/Ambulance Stations",null,null,null,null,null,null,null,0,""]
["Testing Stations",null,null,null,null,null,null,null,0,""]
["Museums",null,null,null,null,null,null,null,0,""]
["Galleries",null,null,null,null,null,null,null,0,""]
["Theatres",null,null,null,null,null,null,null,0,""]
["Libraries",null,null,null,null,null,null,null,0,""]
["Cemeteries/Crematoria",null,null,null,null,null,null,null,0,""]
["Police",null,null,null,null,null,null,null,0,""]
["Purls",null,null,null,null,null,null,null,0,""]
["Public Open Space",null,null,null,null,null,null,null,0,""]
["Nature Reserves",null,null,null,null,null,null,null,0,""]
["Public Ablution Facilities",null,null,null,null,null,null,null,0,""]
["Markets",null,null,null,null,null,null,null,0,""]
["Stalls",null,null,null,null,null,null,null,0,""]
["Abattoirs",null,null,null,null,null,null,null,0,""]
["Airports",null,null,null,null,null,null,null,0,""]
["Taxi Ranks/Bus Terminals",null,null,null,null,null,null,null,0,""]
["Capital Spares",null,null,null,null,null,null,null,0,""]
["Sport and Recreation Facilities",null,{"$f":"SUM(C100:C102)","v":0},0,0,0,0,0,0,"",{"$f":"SUM(K100:K102)","v":0}]
["Indoor Facilities",null,null,null,null,null,null,null,0,""]
["Outdoor Facilities",null,null,null,null,null,null,null,{"$f":"H101-G101","v":0},{"$f":"IF(I101=0,\"\",I101/H101)","v":""}]
["Capital Spares",null,null,null,null,null,null,null,0,""]
["Heritage assets",null,{"$f":"SUM(C104:C108)","v":0},0,0,0,0,0,0,"",{"$f":"SUM(K104:K108)","v":0}]
["Monuments",null,null,null,null,null,null,null,0,""]
["Historic Buildings",null,null,null,null,null,null,null,0,""]
["Works of Art",null,null,null,null,null,null,null,0,""]
["Conservation Areas",null,null,null,null,null,null,null,0,""]
["Other Heritage",null,null,null,null,null,null,null,0,""]
[null,null,null,null,null,null,null,null,0,""]
["Investment properties",null,{"$f":"+C111+C114","v":0},0,0,0,0,0,0,"",{"$f":"+K111+K114","v":0}]
["Revenue Generating",null,{"$f":"SUM(C112:C113)","v":0},0,0,0,0,0,0,"",{"$f":"SUM(K112:K113)","v":0}]
["Improved Property",null,null,null,null,null,null,null,0,""]
["Unimproved Property",null,null,null,null,null,null,null,0,""]
["Non-revenue Generating",null,{"$f":"SUM(C115:C116)","v":0},0,0,0,0,0,0,"",{"$f":"SUM(K115:K116)","v":0}]
["Improved Property",null,null,null,null,null,null,null,0,""]
["Unimproved Property",null,null,null,null,null,null,null,{"$f":"H116-G116","v":0},{"$f":"IF(I116=0,\"\",I116/H116)","v":""}]
["Other assets",null,{"$f":"+C118+C130","v":355326},545746,545746,30031,467226,272874,-194352,-0.71224081444183029,{"$f":"+K118+K130","v":545746}]
["Operational Buildings",null,{"$f":"SUM(C119:C129)","v":355326},545746,545746,30031,467226,272874,-194352,-0.71224081444183029,{"$f":"SUM(K119:K129)","v":545746}]
["Municipal Offices",null,355326,545746,545746,30031,467226,272874,-194352,-0.71224081444183029,545746]
["Pay/Enquiry Points",null,null,null,null,null,null,null,0,""]
["Building Plan Offices",null,null,null,null,null,null,null,0,""]
["Workshops",null,null,null,null,null,null,null,0,""]
["Yards",null,null,null,null,null,null,null,0,""]
["Stores",null,null,null,null,null,null,null,0,""]
["Laboratories",null,null,null,null,null,null,null,0,""]
["Training Centres",null,null,null,null,null,null,null,0,""]
["Manufacturing Plant",null,null,null,null,null,null,null,0,""]
["Depots",null,null,null,null,null,null,null,0,""]
["Capital Spares",null,null,null,null,null,null,null,0,""]
["Housing",null,{"$f":"SUM(C131:C133)","v":0},0,0,0,0,0,0,"",{"$f":"SUM(K131:K133)","v":0}]
["Staff Housing",null,null,null,null,null,null,null,0,""]
["Social Housing",null,null,null,null,null,null,null,0,""]
["Capital Spares",null,null,null,null,null,null,null,0,""]
[null,null,null,null,null,null,null,null,null,""]
["Biological or Cultivated Assets",null,{"$f":"SUM(C136:C136)","v":0},0,0,0,0,0,{"$f":"H135-G135","v":0},"",{"$f":"SUM(K136)","v":0}]
["Biological or Cultivated Assets",null,null,null,null,null,null,null,{"$f":"H136-G136","v":0},""]
[null,null,null,null,null,null,null,null,null,{"$f":"IF(I137=0,\"\",I137/H137)","v":""}]
["Intangible Assets",null,{"$f":"SUM(C139:C140)","v":221717},234628,234628,20617,79613,117312,{"$f":"H138-G138","v":37699},0.32135672394980908,{"$f":"SUM(K139:K140)","v":234628}]
["Servitudes",null,null,null,null,null,null,null,0,""]
["Licences and Rights",null,{"$f":"SUM(C141:C146)","v":221717},234628,234628,20617,79613,117312,37699,0.32135672394980908,{"$f":"SUM(K141:K146)","v":234628}]
["Water Rights",null,0,0,0,0,0,0,0,"",0]
["Effluent Licenses",null,0,0,0,0,0,0,0,"",0]
["Solid Waste Licenses",null,0,0,0,0,0,0,0,"",0]
["Computer Software and Applications",null,221717,234628,234628,20617,79613,117312,37699,0.32135672394980908,234628]
["Load Settlement Software Applications",null,0,0,0,0,0,0,0,"",0]
["Unspecified",null,0,0,0,0,0,0,0,"",0]
[]
["Computer Equipment",null,{"$f":"SUM(C149:C149)","v":145430},712510,712510,16609,58844,356256,{"$f":"H148-G148","v":297412},{"$f":"IF(I148=0,\"\",I148/H148)","v":0.83482664151621311},{"$f":"SUM(K149)","v":712509.99999999988}]
["Computer Equipment",null,145430,712510,712510,16609,58844,356256,{"$f":"H149-G149","v":297412},{"$f":"IF(I149=0,\"\",I149/H149)","v":0.83482664151621311},712509.99999999988]
[]
["Furniture and Office Equipment",null,{"$f":"SUM(C152:C152)","v":228980},1002993,1002993,21926,79996,501498,{"$f":"H151-G151","v":421502},{"$f":"IF(I151=0,\"\",I151/H151)","v":0.84048590423092417},{"$f":"SUM(K152)","v":1002993}]
["Furniture and Office Equipment",null,228980,1002993,1002993,21926,79996,501498,{"$f":"H152-G152","v":421502},{"$f":"IF(I152=0,\"\",I152/H152)","v":0.84048590423092417},1002993]
[null,null,null,null,null,null,null,null,null,{"$f":"IF(I153=0,\"\",I153/H153)","v":""}]
["Machinery and Equipment",null,{"$f":"SUM(C155:C155)","v":130400},175336,175336,11706,40646,87666,{"$f":"H154-G154","v":47020},{"$f":"IF(I154=0,\"\",I154/H154)","v":0.53635388862272715},{"$f":"SUM(K155)","v":175335.99999999997}]
["Machinery and Equipment",null,130400,175336,175336,11706,40646,87666,{"$f":"H155-G155","v":47020},{"$f":"IF(I155=0,\"\",I155/H155)","v":0.53635388862272715},175335.99999999997]
[]
["Transport Assets",null,{"$f":"SUM(C158:C158)","v":745359},926926,926926,64969,252813,463464,{"$f":"H157-G157","v":210651},{"$f":"IF(I157=0,\"\",I157/H157)","v":0.4545142664802444},{"$f":"SUM(K158)","v":926925.99999999988}]
["Transport Assets",null,745359,926926,926926,64969,252813,463464,{"$f":"H158-G158","v":210651},{"$f":"IF(I158=0,\"\",I158/H158)","v":0.4545142664802444},926925.99999999988]
[]
["Land",null,{"$f":"SUM(C161:C161)","v":0},0,0,0,0,0,{"$f":"H160-G160","v":0},{"$f":"IF(I160=0,\"\",I160/H160)","v":""},{"$f":"SUM(K161)","v":0}]
["Land",null,null,null,null,null,null,null,{"$f":"H161-G161","v":0},{"$f":"IF(I161=0,\"\",I161/H161)","v":""}]
[]
["Zoo's, Marine and Non-biological Animals",null,{"$f":"SUM(C164:C164)","v":0},0,0,0,0,0,{"$f":"H163-G163","v":0},{"$f":"IF(I163=0,\"\",I163/H163)","v":""},{"$f":"SUM(K164)","v":0}]
["Zoo's, Marine and Non-biological Animals",null,null,null,null,null,null,null,{"$f":"H164-G164","v":0},{"$f":"IF(I164=0,\"\",I164/H164)","v":""}]
[null,null,null,null,null,null,null,null,null,{"$f":"IF(I165=0,\"\",I165/H165)","v":""}]
["Total Depreciation",1,{"$f":"C7+C75+C103+C110+C117+C135+C138+C148+C151+C154+C157+C160+C163","v":9318525},11173339,11173339,810718,4806692,5586666,779974,0.13961350114719584,{"$f":"K7+K75+K103+K110+K117+K135+K138+K148+K151+K154+K157+K160+K163","v":11173339}]

{"sheet":"SC13e","index":33,"n_rows":171,"n_cols":11,"rows_kept":171,"cut":false,"hidden":false,"merged":[[0,0,0,10],[1,0,2,0],[1,1,2,1]]}
[{"$f":"muni& \" - \"&S71Se& \" - \"&Head57","v":"Choose name from list - Supporting Table SC13e Monthly Budget Statement - capital expenditure on upgrading of existing assets by asset class - Mid-Year Assessment"}]
[{"$f":"desc","v":"Description"},{"$f":"head27","v":"Ref"},{"$f":"Head1","v":"2019/20"},{"$f":"Head2","v":"Budget Year 2020/21"}]
[null,null,{"$f":"Head5","v":"Audited Outcome"},{"$f":"Head6","v":"Original Budget"},{"$f":"Head7","v":"Adjusted Budget"},{"$f":"Head38","v":"Monthly actual"},{"$f":"Head39","v":"YearTD actual"},{"$f":"Head40","v":"YearTD budget"},{"$f":"Head41","v":"YTD variance"},{"$f":"Head41","v":"YTD variance"},{"$f":"Head8","v":"Full Year Forecast"}]
["R thousands",1,null,null,null,null,null,null,null,"%"]
["Capital expenditure on upgrading of existing assets by Asset Class/Sub-class"]
[]
["Infrastructure",null,{"$f":"C8+C13+C17+C27+C38+C45+C53+C63+C69","v":0},0,0,0,482509,0,{"$f":"H7-G7","v":-482509},{"$f":"IF(I7=0,\"\",I7/H7)","v":{"$error":"#DIV/0!"}},{"$f":"K8+K13+K17+K27+K38+K45+K53+K63+K69","v":0}]
["Roads Infrastructure",null,{"$f":"SUM(C9:C12)","v":0},0,0,0,482509,0,-482509,{"$error":"#DIV/0!"},{"$f":"SUM(K9:K12)","v":0}]
["Roads",null,0,0,0,null,482509,0,-482509,{"$error":"#DIV/0!"}]
["Road Structures",null,null,null,null,null,null,null,0,""]
["Road Furniture",null,null,null,null,null,null,null,0,""]
["Capital Spares",null,null,null,null,null,null,null,0,""]
["Storm water Infrastructure",null,{"$f":"SUM(C14:C16)","v":0},0,0,0,0,0,0,"",{"$f":"SUM(K14:K16)","v":0}]
["Drainage Collection",null,null,null,null,null,null,null,0,""]
["Storm water Conveyance",null,null,null,null,null,null,null,0,""]
["Attenuation",null,null,null,null,null,null,null,0,""]
["Electrical Infrastructure",null,{"$f":"SUM(C18:C26)","v":0},0,0,0,0,0,0,"",{"$f":"SUM(K18:K26)","v":0}]
["Power Plants",null,null,null,null,null,null,null,0,""]
["HV Substations",null,null,null,null,null,null,null,0,""]
["HV Switching Station",null,null,null,null,null,null,null,0,""]
["HV Transmission Conductors",null,null,null,null,null,null,null,0,""]
["MV Substations",null,null,null,null,null,null,null,0,""]
["MV Switching Stations",null,null,null,null,null,null,null,0,""]
["MV Networks",null,null,null,null,null,null,null,0,""]
["LV Networks",null,null,null,null,null,null,null,0,""]
["Capital Spares",null,null,null,null,null,null,null,0,""]
["Water Supply Infrastructure",null,{"$f":"SUM(C28:C37)","v":0},0,0,0,0,0,0,"",{"$f":"SUM(K28:K37)","v":0}]
["Dams and Weirs",null,null,null,null,null,null,null,0,""]
["Boreholes",null,null,null,null,null,null,null,0,""]
["Reservoirs",null,null,null,null,null,null,null,0,""]
["Pump Stations",null,null,null,null,null,null,null,0,""]
["Water Treatment Works",null,null,null,null,null,null,null,0,""]
["Bulk Mains",null,null,null,null,null,null,null,0,""]
["Distribution",null,null,null,null,null,null,null,0,""]
["Distribution Points",null,null,null,null,null,null,null,0,""]
["PRV Stations",null,null,null,null,null,null,null,0,""]
["Capital Spares",null,null,null,null,null,null,null,0,""]
["Sanitation Infrastructure",null,{"$f":"SUM(C39:C44)","v":0},0,0,0,0,0,0,"",{"$f":"SUM(K39:K44)","v":0}]
["Pump Station",null,null,null,null,null,null,null,0,""]
["Reticulation",null,null,null,null,null,null,null,0,""]
["Waste Water Treatment Works",null,null,null,null,null,null,null,0,""]
["Outfall Sewers",null,null,null,null,null,null,null,0,""]
["Toilet Facilities",null,null,null,null,null,null,null,0,""]
["Capital Spares",null,null,null,null,null,null,null,0,""]
["Solid Waste Infrastructure",null,{"$f":"SUM(C46:C52)","v":0},0,0,0,0,0,0,"",{"$f":"SUM(K46:K52)","v":0}]
["Landfill Sites",null,null,null,null,null,null,null,0,""]
["Waste Transfer Stations",null,null,null,null,null,null,null,0,""]
["Waste Processing Facilities",null,null,null,null,null,null,null,0,""]
["Waste Drop-off Points",null,null,null,null,null,null,null,0,""]
["Waste Separation Facilities",null,null,null,null,null,null,null,0,""]
["Electricity Generation Facilities",null,null,null,null,null,null,null,0,""]
["Capital Spares",null,null,null,null,null,null,null,0,""]
["Rail Infrastructure",null,{"$f":"SUM(C54:C62)","v":0},0,0,0,0,0,0,"",{"$f":"SUM(K54:K62)","v":0}]
["Rail Lines",null,null,null,null,null,null,null,0,""]
["Rail Structures",null,null,null,null,null,null,null,0,""]
["Rail Furniture",null,null,null,null,null,null,null,0,""]
["Drainage Collection",null,null,null,null,null,null,null,0,""]
["Storm water Conveyance",null,null,null,null,null,null,null,0,""]
["Attenuation",null,null,null,null,null,null,null,0,""]
["MV Substations",null,null,null,null,null,null,null,0,""]
["LV Networks",null,null,null,null,null,null,null,0,""]
["Capital Spares",null,null,null,null,null,null,null,0,""]
["Coastal Infrastructure",null,{"$f":"SUM(C64:C68)","v":0},0,0,0,0,0,0,"",{"$f":"SUM(K64:K68)","v":0}]
["Sand Pumps",null,null,null,null,null,null,null,0,""]
["Piers",null,null,null,null,null,null,null,0,""]
["Revetments",null,null,null,null,null,null,null,0,""]
["Promenades",null,null,null,null,null,null,null,0,""]
["Capital Spares",null,null,null,null,null,null,null,0,""]
["Information and Communication Infrastructure",null,{"$f":"SUM(C70:C73)","v":0},0,0,0,0,0,0,"",{"$f":"SUM(K70:K73)","v":0}]
["Data Centres",null,null,null,null,null,null,null,0,""]
["Core Layers",null,null,null,null,null,null,null,0,""]
["Distribution Layers",null,null,null,null,null,null,null,0,""]
["Capital Spares",null,null,null,null,null,null,null,0,""]
[null,null,null,null,null,null,null,null,null,""]
["Community Assets",null,{"$f":"+C76+C99","v":0},0,0,0,0,0,0,"",{"$f":"+K76+K99","v":0}]
["Community Facilities",null,{"$f":"SUM(C77:C98)","v":0},0,0,0,0,0,0,"",{"$f":"SUM(K77:K98)","v":0}]
["Halls",null,null,null,null,null,null,null,0,""]
["Centres",null,null,null,null,null,null,null,0,""]
["Crèches",null,null,null,null,null,null,null,0,""]
["Clinics/Care Centres",null,null,null,null,null,null,null,0,""]
["Fire/Ambulance Stations",null,null,null,null,null,null,null,0,""]
["Testing Stations",null,null,null,null,null,null,null,0,""]
["Museums",null,null,null,null,null,null,null,0,""]
["Galleries",null,null,null,null,null,null,null,0,""]
["Theatres",null,null,null,null,null,null,null,0,""]
["Libraries",null,null,null,null,null,null,null,0,""]
["Cemeteries/Crematoria",null,null,null,null,null,null,null,0,""]
["Police",null,null,null,null,null,null,null,0,""]
["Purls",null,null,null,null,null,null,null,0,""]
["Public Open Space",null,null,null,null,null,null,null,0,""]
["Nature Reserves",null,null,null,null,null,null,null,0,""]
["Public Ablution Facilities",null,null,null,null,null,null,null,0,""]
["Markets",null,null,null,null,null,null,null,0,""]
["Stalls",null,null,null,null,null,null,null,0,""]
["Abattoirs",null,null,null,null,null,null,null,0,""]
["Airports",null,null,null,null,null,null,null,0,""]
["Taxi Ranks/Bus Terminals",null,null,null,null,null,null,null,0,""]
["Capital Spares",null,null,null,null,null,null,null,0,""]
["Sport and Recreation Facilities",null,{"$f":"SUM(C100:C102)","v":0},0,0,0,0,0,0,"",{"$f":"SUM(K100:K102)","v":0}]
["Indoor Facilities",null,null,null,null,null,null,null,0,""]
["Outdoor Facilities",null,null,null,null,null,null,null,{"$f":"H101-G101","v":0},{"$f":"IF(I101=0,\"\",I101/H101)","v":""}]
["Capital Spares",null,null,null,null,null,null,null,0,""]
["Heritage assets",null,{"$f":"SUM(C104:C108)","v":0},0,0,0,0,0,0,"",{"$f":"SUM(K104:K108)","v":0}]
["Monuments",null,null,null,null,null,null,null,0,""]
["Historic Buildings",null,null,null,null,null,null,null,0,""]
["Works of Art",null,null,null,null,null,null,null,0,""]
["Conservation Areas",null,null,null,null,null,null,null,0,""]
["Other Heritage",null,null,null,null,null,null,null,0,""]
[null,null,null,null,null,null,null,null,0,""]
["Investment properties",null,{"$f":"+C111+C114","v":0},0,0,0,0,0,0,"",{"$f":"+K111+K114","v":0}]
["Revenue Generating",null,{"$f":"SUM(C112:C113)","v":0},0,0,0,0,0,0,"",{"$f":"SUM(K112:K113)","v":0}]
["Improved Property",null,null,null,null,null,null,null,0,""]
["Unimproved Property",null,null,null,null,null,null,null,0,""]
["Non-revenue Generating",null,{"$f":"SUM(C115:C116)","v":0},0,0,0,0,0,0,"",{"$f":"SUM(K115:K116)","v":0}]
["Improved Property",null,null,null,null,null,null,null,0,""]
["Unimproved Property",null,null,null,null,null,null,null,{"$f":"H116-G116","v":0},{"$f":"IF(I116=0,\"\",I116/H116)","v":""}]
["Other assets",null,{"$f":"+C118+C130","v":0},1000000,1000000,0,0,499998,499998,1,{"$f":"+K118+K130","v":999999.99999999988}]
["Operational Buildings",null,{"$f":"SUM(C119:C129)","v":0},1000000,1000000,0,0,499998,499998,1,{"$f":"SUM(K119:K129)","v":999999.99999999988}]
["Municipal Offices",null,0,1000000,1000000,0,0,499998,499998,1,999999.99999999988]
["Pay/Enquiry Points",null,null,null,null,null,null,null,0,""]
["Building Plan Offices",null,null,null,null,null,null,null,0,""]
["Workshops",null,null,null,null,null,null,null,0,""]
["Yards",null,null,null,null,null,null,null,0,""]
["Stores",null,null,null,null,null,null,null,0,""]
["Laboratories",null,null,null,null,null,null,null,0,""]
["Training Centres",null,null,null,null,null,null,null,0,""]
["Manufacturing Plant",null,null,null,null,null,null,null,0,""]
["Depots",null,null,null,null,null,null,null,0,""]
["Capital Spares",null,null,null,null,null,null,null,0,""]
["Housing",null,{"$f":"SUM(C131:C133)","v":0},0,0,0,0,0,0,"",{"$f":"SUM(K131:K133)","v":0}]
["Staff Housing",null,null,null,null,null,null,null,0,""]
["Social Housing",null,null,null,null,null,null,null,0,""]
["Capital Spares",null,null,null,null,null,null,null,0,""]
[null,null,null,null,null,null,null,null,null,""]
["Biological or Cultivated Assets",null,{"$f":"SUM(C136:C136)","v":0},0,0,0,0,0,{"$f":"H135-G135","v":0},"",{"$f":"SUM(K136)","v":0}]
["Biological or Cultivated Assets",null,null,null,null,null,null,null,{"$f":"H136-G136","v":0},""]
[null,null,null,null,null,null,null,null,null,{"$f":"IF(I137=0,\"\",I137/H137)","v":""}]
["Intangible Assets",null,{"$f":"SUM(C139:C140)","v":0},0,0,0,0,0,{"$f":"H138-G138","v":0},"",{"$f":"SUM(K139:K140)","v":0}]
["Servitudes",null,null,null,null,null,null,null,0,""]
["Licences and Rights",null,{"$f":"SUM(C141:C146)","v":0},0,0,0,0,0,0,"",{"$f":"SUM(K141:K146)","v":0}]
["Water Rights",null,null,null,null,null,null,null,0,""]
["Effluent Licenses",null,null,null,null,null,null,null,0,""]
["Solid Waste Licenses",null,null,null,null,null,null,null,0,""]
["Computer Software and Applications",null,null,null,null,null,null,null,0,""]
["Load Settlement Software Applications",null,null,null,null,null,null,null,0,""]
["Unspecified",null,null,null,null,null,null,null,0,""]
[]
["Computer Equipment",null,{"$f":"SUM(C149:C149)","v":0},0,0,0,0,0,{"$f":"H148-G148","v":0},{"$f":"IF(I148=0,\"\",I148/H148)","v":""},{"$f":"SUM(K149)","v":0}]
["Computer Equipment",null,null,null,null,null,null,null,{"$f":"H149-G149","v":0},{"$f":"IF(I149=0,\"\",I149/H149)","v":""}]
[]
["Furniture and Office Equipment",null,{"$f":"SUM(C152:C152)","v":0},0,0,0,0,0,{"$f":"H151-G151","v":0},{"$f":"IF(I151=0,\"\",I151/H151)","v":""},{"$f":"SUM(K152)","v":0}]
["Furniture and Office Equipment",null,null,null,null,null,null,null,{"$f":"H152-G152","v":0},{"$f":"IF(I152=0,\"\",I152/H152)","v":""}]
[null,null,null,null,null,null,null,null,null,{"$f":"IF(I153=0,\"\",I153/H153)","v":""}]
["Machinery and Equipment",null,{"$f":"SUM(C155:C155)","v":0},0,0,0,0,0,{"$f":"H154-G154","v":0},{"$f":"IF(I154=0,\"\",I154/H154)","v":""},{"$f":"SUM(K155)","v":0}]
["Machinery and Equipment",null,null,null,null,null,null,null,{"$f":"H155-G155","v":0},{"$f":"IF(I155=0,\"\",I155/H155)","v":""}]
[]
["Transport Assets",null,{"$f":"SUM(C158:C158)","v":0},0,0,0,0,0,{"$f":"H157-G157","v":0},{"$f":"IF(I157=0,\"\",I157/H157)","v":""},{"$f":"SUM(K158)","v":0}]
["Transport Assets",null,null,null,null,null,null,null,{"$f":"H158-G158","v":0},{"$f":"IF(I158=0,\"\",I158/H158)","v":""}]
[]
["Land",null,{"$f":"SUM(C161:C161)","v":0},0,0,0,0,0,{"$f":"H160-G160","v":0},{"$f":"IF(I160=0,\"\",I160/H160)","v":""},{"$f":"SUM(K161)","v":0}]
["Land",null,null,null,null,null,null,null,{"$f":"H161-G161","v":0},{"$f":"IF(I161=0,\"\",I161/H161)","v":""}]
[null,null,null,null,null,null,null,null,null,"."]
["Zoo's, Marine and Non-biological Animals",null,{"$f":"SUM(C164:C164)","v":0},0,0,0,0,0,{"$f":"H163-G163","v":0},{"$f":"IF(I163=0,\"\",I163/H163)","v":""},{"$f":"SUM(K164)","v":0}]
["Zoo's, Marine and Non-biological Animals",null,null,null,null,null,null,null,{"$f":"H164-G164","v":0},{"$f":"IF(I164=0,\"\",I164/H164)","v":""}]
[null,null,null,null,null,null,null,null,null,{"$f":"IF(I165=0,\"\",I165/H165)","v":""}]
["Total Capital Expenditure on upgrading of existing assets ",1,{"$f":"C7+C75+C103+C110+C117+C135+C138+C148+C151+C154+C157+C160+C163","v":0},1000000,1000000,0,482509,499998,{"$f":"H166-G166","v":17489},{"$f":"IF(I166=0,\"\",I166/H166)","v":3.4978139912559651E-2},{"$f":"K7+K75+K103+K110+K117+K135+K138+K148+K151+K154+K157+K160+K163","v":999999.99999999988}]
[]
[{"$f":"head27a","v":"References"}]
["1. Total Capital Expenditure on new assets (SC13a) plus Total Capital Expenditure on renewal of existing assets (SC13b) plus Total Capital Expenditure on upgrading of existing assets (SC13e)  must reconcile to total capital expenditure in Table C5"]
[]
["check balance",null,{"$f":"C166+SC13a!C166+SC13b!C166-'C5-Capex'!C40","v":5887005},{"$f":"D166+SC13a!D166+SC13b!D166-'C5-Capex'!D40","v":0},{"$f":"E166+SC13a!E166+SC13b!E166-'C5-Capex'!E40","v":0},{"$f":"F166+SC13a!F166+SC13b!F166-'C5-Capex'!F40","v":0},{"$f":"G166+SC13a!G166+SC13b!G166-'C5-Capex'!G40","v":0},{"$f":"H166+SC13a!H166+SC13b!H166-'C5-Capex'!H40","v":0},null,null,{"$f":"K166+SC13a!K166+SC13b!K166-'C5-Capex'!K40","v":1.3400000035762787}]

{"sheet":"SC71charts","index":34,"n_rows":104,"n_cols":10,"rows_kept":104,"cut":false,"hidden":false,"merged":[]}
[{"$f":"'Template names'!B102","v":"Chart C1 2020/21 Capital Expenditure Monthly Trend: actual v target"}]
["Month",{"$f":"'SC12'!B2","v":"2019/20"},{"$f":"'SC12'!C3","v":"Original Budget"},{"$f":"'SC12'!D3","v":"Adjusted Budget"},{"$f":"'SC12'!E3","v":"Monthly actual"}]
[{"$f":"LEFT('SC12'!A6,3)","v":"Jul"},{"$f":"'SC12'!B6","v":15787663.333333334},{"$f":"'SC12'!C6","v":2661750},{"$f":"'SC12'!D6","v":2661750},{"$f":"'SC12'!E6","v":6273247}]
[{"$f":"LEFT('SC12'!A7,3)","v":"Aug"},{"$f":"'SC12'!B7","v":15787663.333333334},{"$f":"'SC12'!C7","v":2661750},{"$f":"'SC12'!D7","v":2661750},{"$f":"'SC12'!E7","v":455488}]
[{"$f":"LEFT('SC12'!A8,3)","v":"Sep"},{"$f":"'SC12'!B8","v":15787663.333333334},{"$f":"'SC12'!C8","v":2661750},{"$f":"'SC12'!D8","v":2661750},{"$f":"'SC12'!E8","v":1298996}]
[{"$f":"LEFT('SC12'!A9,3)","v":"Oct"},{"$f":"'SC12'!B9","v":15787663.333333334},{"$f":"'SC12'!C9","v":2661750},{"$f":"'SC12'!D9","v":2661750},{"$f":"'SC12'!E9","v":5896600}]
[{"$f":"LEFT('SC12'!A10,3)","v":"Nov"},{"$f":"'SC12'!B10","v":15787663.333333334},{"$f":"'SC12'!C10","v":2661750},{"$f":"'SC12'!D10","v":2661750},{"$f":"'SC12'!E10","v":4173969}]
[{"$f":"LEFT('SC12'!A11,3)","v":"Dec"},{"$f":"'SC12'!B11","v":15787663.333333334},{"$f":"'SC12'!C11","v":2661750},{"$f":"'SC12'!D11","v":2661750},{"$f":"'SC12'!E11","v":4030949}]
[{"$f":"LEFT('SC12'!A12,3)","v":"Jan"},{"$f":"'SC12'!B12","v":15787663.333333334},{"$f":"'SC12'!C12","v":2661750},{"$f":"'SC12'!D12","v":2661750},{"$f":"'SC12'!E12","v":0}]
[{"$f":"LEFT('SC12'!A13,3)","v":"Feb"},{"$f":"'SC12'!B13","v":15787663.333333334},{"$f":"'SC12'!C13","v":2661750},{"$f":"'SC12'!D13","v":2661750},{"$f":"'SC12'!E13","v":0}]
[{"$f":"LEFT('SC12'!A14,3)","v":"Mar"},{"$f":"'SC12'!B14","v":15787663.333333334},{"$f":"'SC12'!C14","v":2661750},{"$f":"'SC12'!D14","v":2661750},{"$f":"'SC12'!E14","v":0}]
[{"$f":"LEFT('SC12'!A15,3)","v":"Apr"},{"$f":"'SC12'!B15","v":15787663.333333334},{"$f":"'SC12'!C15","v":2661750},{"$f":"'SC12'!D15","v":2661750},{"$f":"'SC12'!E15","v":0}]
[{"$f":"LEFT('SC12'!A16,3)","v":"May"},{"$f":"'SC12'!B16","v":15787663.333333334},{"$f":"'SC12'!C16","v":2661750},{"$f":"'SC12'!D16","v":2661750},{"$f":"'SC12'!E16","v":0}]
[{"$f":"LEFT('SC12'!A17,3)","v":"Jun"},{"$f":"'SC12'!B17","v":15787663.333333334},{"$f":"'SC12'!C17","v":2661750},{"$f":"'SC12'!D17","v":2661750},{"$f":"'SC12'!E17","v":0}]
[]
[]
[]
[]
[]
[]
[]
[]
[]
[]
[]
[{"$f":"'Template names'!B103","v":"Chart C2 2020/21 Capital Expenditure: YTD actual v YTD target"}]
["Month",{"$f":"'SC12'!F3","v":"YearTD actual"},{"$f":"'SC12'!G3","v":"YearTD budget"}]
[{"$f":"LEFT('SC12'!A6,3)","v":"Jul"},{"$f":"'SC12'!F6","v":6273247},{"$f":"'SC12'!G6","v":2661750}]
[{"$f":"LEFT('SC12'!A7,3)","v":"Aug"},{"$f":"'SC12'!F7","v":6728735},{"$f":"'SC12'!G7","v":5323500}]
[{"$f":"LEFT('SC12'!A8,3)","v":"Sep"},{"$f":"'SC12'!F8","v":8027731},{"$f":"'SC12'!G8","v":7985250}]
[{"$f":"LEFT('SC12'!A9,3)","v":"Oct"},{"$f":"'SC12'!F9","v":13924331},{"$f":"'SC12'!G9","v":10647000}]
[{"$f":"LEFT('SC12'!A10,3)","v":"Nov"},{"$f":"'SC12'!F10","v":18098300},{"$f":"'SC12'!G10","v":13308750}]
[{"$f":"LEFT('SC12'!A11,3)","v":"Dec"},{"$f":"'SC12'!F11","v":22129249},{"$f":"'SC12'!G11","v":15970500}]
[{"$f":"LEFT('SC12'!A12,3)","v":"Jan"},{"$f":"'SC12'!F12","v":""},{"$f":"'SC12'!G12","v":18632250}]
[{"$f":"LEFT('SC12'!A13,3)","v":"Feb"},{"$f":"'SC12'!F13","v":""},{"$f":"'SC12'!G13","v":21294000}]
[{"$f":"LEFT('SC12'!A14,3)","v":"Mar"},{"$f":"'SC12'!F14","v":""},{"$f":"'SC12'!G14","v":23955750}]
[{"$f":"LEFT('SC12'!A15,3)","v":"Apr"},{"$f":"'SC12'!F15","v":""},{"$f":"'SC12'!G15","v":26617500}]
[{"$f":"LEFT('SC12'!A16,3)","v":"May"},{"$f":"'SC12'!F16","v":""},{"$f":"'SC12'!G16","v":29279250}]
[{"$f":"LEFT('SC12'!A17,3)","v":"Jun"},{"$f":"'SC12'!F17","v":""},{"$f":"'SC12'!G17","v":31941000}]
[]
[]
[]
[]
[]
[]
[]
[]
[]
[]
[]
[{"$f":"'Template names'!B104","v":"Chart C3 Aged Consumer Debtors Analysis"}]
[null,{"$f":"'SC3'!C3","v":"0-30 Days"},{"$f":"'SC3'!D3","v":"31-60 Days"},{"$f":"'SC3'!E3","v":"61-90 Days"},{"$f":"'SC3'!F3","v":"91-120 Days"},{"$f":"'SC3'!G3","v":"121-150 Dys"},{"$f":"'SC3'!H3","v":"151-180 Dys"},{"$f":"'SC3'!I3","v":"181 Dys-1 Yr"},{"$f":"'SC3'!J3","v":"Over 1Yr"}]
[{"$f":"Head2","v":"Budget Year 2020/21"},{"$f":"'SC3'!C14","v":1263779},{"$f":"'SC3'!D14","v":681062},{"$f":"'SC3'!E14","v":-760966},{"$f":"'SC3'!F14","v":633521},{"$f":"'SC3'!G14","v":468361},{"$f":"'SC3'!H14","v":449384},{"$f":"'SC3'!I14","v":2527397},{"$f":"'SC3'!J14","v":23872824}]
[{"$f":"Head1","v":"2019/20"},{"$f":"'SC3'!C15","v":0},{"$f":"'SC3'!D15","v":0},{"$f":"'SC3'!E15","v":0},{"$f":"'SC3'!F15","v":0},{"$f":"'SC3'!G15","v":0},{"$f":"'SC3'!H15","v":0},{"$f":"'SC3'!I15","v":0},{"$f":"'SC3'!J15","v":0}]
[]
[]
[]
[]
[]
[]
[]
[]
[]
[]
[]
[]
[]
[]
[]
[]
[]
[]
[]
[]
[]
[{"$f":"'Template names'!B105","v":"Chart C4 Consumer Debtors (total by Debtor Customer Category)"}]
[null,{"$f":"Head1","v":"2019/20"},{"$f":"Head2","v":"Budget Year 2020/21"}]
[{"$f":"'SC3'!A17","v":"Organs of State"},{"$f":"C78*0.97","v":635858.28},{"$f":"'SC3'!K17","v":655524}]
[{"$f":"'SC3'!A18","v":"Commercial"},{"$f":"C79*0.97","v":12830357.810000001},{"$f":"'SC3'!K18","v":13227173}]
[{"$f":"'SC3'!A19","v":"Households"},{"$f":"C80*0.97","v":4171637.29},{"$f":"'SC3'!K19","v":4300657}]
[{"$f":"'SC3'!A20","v":"Other"},{"$f":"C81*0.97","v":10623447.76},{"$f":"'SC3'!K20","v":10952008}]
[]
[]
[]
[]
[]
[]
[]
[]
[]
[]
[]
[]
[]
[]
[]
[]
[]
[]
[]
[{"$f":"'Template names'!B106","v":"Chart C5 Aged Creditors Analysis"}]
[null,{"$f":"'SC4'!A6","v":"Bulk Electricity"},{"$f":"'SC4'!A7","v":"Bulk Water"},{"$f":"'SC4'!A8","v":"PAYE deductions"},{"$f":"'SC4'!A9","v":"VAT (output less input)"},{"$f":"'SC4'!A10","v":"Pensions / Retirement deductions"},{"$f":"'SC4'!A11","v":"Loan repayments"},{"$f":"'SC4'!A12","v":"Trade Creditors"},{"$f":"'SC4'!A13","v":"Auditor General"},{"$f":"'SC4'!A14","v":"Other"}]
[{"$f":"A54","v":"2019/20"},{"$f":"'SC4'!L6","v":0},{"$f":"'SC4'!L7","v":0},{"$f":"'SC4'!L8","v":0},{"$f":"'SC4'!L9","v":0},{"$f":"'SC4'!L10","v":0},{"$f":"'SC4'!L11","v":0},{"$f":"'SC4'!L12","v":0},{"$f":"'SC4'!L13","v":0},{"$f":"'SC4'!L14","v":0}]
[{"$f":"A53","v":"Budget Year 2020/21"},{"$f":"'SC4'!K6","v":0},{"$f":"'SC4'!K7","v":0},{"$f":"'SC4'!K8","v":0},{"$f":"'SC4'!K9","v":0},{"$f":"'SC4'!K10","v":0},{"$f":"'SC4'!K11","v":0},{"$f":"'SC4'!K12","v":0},{"$f":"'SC4'!K13","v":0},{"$f":"'SC4'!K14","v":1175646}]